{"text_format":"2","workbook":"xlsx","n_sheets":7,"sheets":["Info","Eingabe","Ergebnis","Umweltdeklaration","LCIA","Prüfwert","Ergebnis pro Tonne"],"not_rendered":{"charts":2,"images":1,"macros":0,"external_links":0,"defined_names":26,"comments":2,"pivot_tables":0},"unopened":[],"bounds":{"document_bytes":16777216,"sheet_cells":100000,"run_cost":"one","rows_first":2000,"rows_last":500,"rows_between":2000,"halvings":0,"cell_chars":16384,"cell_head_chars":4096},"cells_cut":0,"cells_raw":0,"read":"whole","date_system":"1900"}

{"sheet":"Info","index":0,"n_rows":35,"n_cols":1,"rows_kept":35,"cut":false,"hidden":false,"merged":[[31,0,31,1],[32,0,32,1]]}
[]
[{"$f":"Eingabe!B2","v":"Naturemade \"Recycling Star\" Prüfung"}]
["Kennwertmodell erstellt durch Livia Ramseier, treeze Ltd., März 2020"]
[]
["Anleitung"]
["Alle hellen Felder im Blatt „Eingabe“ müssen ausgefüllt werden. Bei Eingabe einer Null erscheint die für die Eingabe geforderte Einheit. Aus den Drop-Down Menüs müssen die passenden Anlagenspezifikationen ausgewählt werden."]
["Die automatische Berechnung in Excel muss eingeschaltet sein (/Extras/Optionen/Berechnung --> automatisch) oder man kann mit der [F9] Taste jeweils Formeln neu berechnen lassen."]
["Alle Angaben müssen für ein Jahr eingegeben werden."]
[]
["Umweltdeklaration"]
{"$rows_left_out":26}
{"sheet":"Eingabe","index":1,"n_rows":77,"n_cols":7,"rows_kept":77,"cut":false,"hidden":false,"merged":[[1,1,1,3]]}
[null,null,41,42]
[null,"Naturemade \"Recycling Star\" Prüfung"]
[]
[null,"KVA (Name / Standort)"]
[null,"Bezugsjahr"]
[]
[null,"Anlagetyp"]
[null,"Rauchgasreinigung",null,null,1]
[null,"DeNOx Technologie",null,null,2]
[]
{"$rows_left_out":68}
{"sheet":"Ergebnis","index":2,"n_rows":73,"n_cols":9,"rows_kept":73,"cut":false,"hidden":false,"merged":[[4,6,5,7],[0,5,1,5],[0,6,1,6],[4,5,5,5]]}
[{"$nulls":5},{"$f":"G11","v":0},{"$f":"H11","v":0}]
[]
[null," Umweltbelastung absolut","Allokation der Umweltbelastung auf die Produkte","Prüfwert",null,null,"Umweltbelastung absolut","Prüfwert"]
[{"$f":"Umweltdeklaration!$B5","v":"KVA (inkl. direkte Emissionen)"},{"$f":"Umweltdeklaration!H5","v":0},null,null,null,"EI'99-aggregated, Hierarchist",{"$f":"$B27","v":0},{"$f":"$D27","v":0}]
[{"$f":"Umweltdeklaration!$B6","v":"Hilfsstoffe + importierte Energieträger"},{"$f":"Umweltdeklaration!H6","v":0},null,null,null,{"$f":"IF(G5<=1,I6,I7)","v":{"$error":"#DIV/0!"}},{"$f":"G4/H4","v":{"$error":"#DIV/0!"}}]
[{"$f":"Umweltdeklaration!$B7","v":"Behandlung Flugasche (inkl. Deponie)"},{"$f":"Umweltdeklaration!H7","v":0},{"$nulls":6},"Kriterium GK-KVA1 Grenzwert Umweltbelastung erfüllt"]
[{"$f":"Umweltdeklaration!$B8","v":"Deponierung Bodenasche"},{"$f":"Umweltdeklaration!H8","v":0},{"$nulls":6},"Kriterium GK-KVA1 Grenzwert Umweltbelastung nicht erfüllt"]
[{"$nulls":5},"Kriterium Energienettoeffizienz ENE","Energie-nettoeffizienz ENE","Prüfwert"]
[{"$nulls":5},{"$f":"IF(G9>100%,I11,IF(G9>=H9,I9,I10))","v":{"$error":"#DIV/0!"}},{"$f":"Prüfwert!C77","v":{"$error":"#DIV/0!"}},0.65,"Kriterium LK-KVA5 Energienettoeffizienz ENE erfüllt"]
[{"$nulls":8},"Kriterium LK-KVA5 Energienettoeffizienz ENE nicht erfüllt"]
{"$rows_left_out":64}
{"sheet":"Umweltdeklaration","index":3,"n_rows":25,"n_cols":11,"rows_kept":25,"cut":false,"hidden":false,"merged":[]}
[{"$nulls":7},29,35,34,31]
[null,"Verbrennung von Siedlungsabfall in",{"$f":"Eingabe!C4","v":0},"EI'99-aggregated, Hierarchist","Anteil",null,null,"EI'99-aggregated, Hierarchist","Klimawandel","KEA, ne","ökologische Knappheit"]
[null,null,null,"Pkt",null,null,null,"Pkt","kg CO2-eq","MJ-eq","UBP 13 Pkte"]
[null,"Import von Abfall",null,null,{"$f":"H4/H$10","v":{"$error":"#DIV/0!"}},null,null,{"$f":"LCIA!$AK9+LCIA!$AL9","v":0},{"$f":"LCIA!$AK10+LCIA!$AL10","v":0},{"$f":"LCIA!$AK11+LCIA!$AL11","v":0},{"$f":"LCIA!$AK12+LCIA!$AL12","v":0}]
[null,"KVA (inkl. direkte Emissionen)",null,null,{"$error":"#DIV/0!"},null,null,{"$f":"LCIA!$E9+LCIA!$F9+LCIA!$G9+LCIA!$L9+LCIA!$M9+LCIA!$AM9+LCIA!$AN9+LCIA!$AO9+LCIA!$AP9+LCIA!$AQ9+LCIA!$AR9+LCIA!$AS9","v":0},{"$f":"LCIA!$E10+LCIA!$F10+LCIA!$G9+LCIA!$L10+LCIA!$M10+LCIA!$AM10+LCIA!$AN10+LCIA!$AO10+LCIA!$AP10+LCIA!$AQ10+LCIA!$AR10+LCIA!$AS10","v":0},{"$f":"LCIA!$E11+LCIA!$F11+LCIA!$G9+LCIA!$L11+LCIA!$M11+LCIA!$AM11+LCIA!$AN11+LCIA!$AO11+LCIA!$AP11+LCIA!$AQ11+LCIA!$AR11+LCIA!$AS11","v":0},{"$f":"LCIA!$E12+LCIA!$F12+LCIA!$G9+LCIA!$L12+LCIA!$M12+LCIA!$AM12+LCIA!$AN12+LCIA!$AO12+LCIA!$AP12+LCIA!$AQ12+LCIA!$AR12+LCIA!$AS12","v":0}]
[null,"Hilfsstoffe + importierte Energieträger",null,null,{"$error":"#DIV/0!"},null,null,{"$f":"SUM(LCIA!$Q9:$AH9)","v":0},{"$f":"SUM(LCIA!$Q10:$AH10)","v":0},{"$f":"SUM(LCIA!$Q11:$AH11)","v":0},{"$f":"SUM(LCIA!$Q12:$AH12)","v":0}]
[null,"Behandlung Flugasche (inkl. Deponie)",null,null,{"$error":"#DIV/0!"},null,null,{"$f":"LCIA!$C9+LCIA!$D9+LCIA!H9+LCIA!I9+LCIA!$N9+LCIA!$O9+LCIA!$P9+LCIA!$AI9","v":0},{"$f":"LCIA!$C10+LCIA!$D10+LCIA!H10+LCIA!I10+LCIA!$N10+LCIA!$O10+LCIA!$P10+LCIA!$AI10","v":0},{"$f":"LCIA!$C11+LCIA!$D11+LCIA!H11+LCIA!I11+LCIA!$N11+LCIA!$O11+LCIA!$P11+LCIA!$AI11","v":0},{"$f":"LCIA!$C12+LCIA!$D12+LCIA!H12+LCIA!I12+LCIA!$N12+LCIA!$O12+LCIA!$P12+LCIA!$AI12","v":0}]
[null,"Deponierung Bodenasche",null,null,{"$error":"#DIV/0!"},null,null,{"$f":"LCIA!$J9+LCIA!$K9","v":0},{"$f":"LCIA!$J10+LCIA!$K10","v":0},{"$f":"LCIA!$J11+LCIA!$K11","v":0},{"$f":"LCIA!$J12+LCIA!$K12","v":0}]
[null,"Deponierung Gewebefilterrückstände",null,null,{"$error":"#DIV/0!"},null,null,{"$f":"LCIA!AJ9","v":0},{"$f":"LCIA!AJ10","v":0},{"$f":"LCIA!AJ11","v":0},{"$f":"LCIA!AJ12","v":0}]
[null,"Total",null,null,{"$error":"#DIV/0!"},null,null,{"$f":"SUM(H5:H8)","v":0},{"$f":"SUM(I5:I8)","v":0},{"$f":"SUM(J5:J8)","v":0},{"$f":"SUM(K5:K8)","v":0}]
{"$rows_left_out":16}
{"sheet":"LCIA","index":4,"n_rows":250,"n_cols":48,"rows_kept":250,"cut":false,"hidden":true,"merged":[]}
["Zeile 1",null,39,37,12,12,12,null,null,12,12,12,12,37,37,38,13,17,47,48,16,18,21,43,15,23,14,19,20,45,46,22,null,null,40,12,52,53,12,27,28,29,51,26,26]
["Zeile 2",null,null,38,{"$nulls":31},44]
[null,null,"disposal, municipal solid waste, fly ash, to residual material landfill/CH U","disposal, municipal solid waste, fly ash, to slag compartment/CH U","disposal, municipal solid waste, SCR high dust/CH U","disposal, municipal solid waste, SCR low dust/CH U","disposal, municipal solid waste, SNCR/CH U","disposal, municipal solid waste, scrubber sludge, to residual material landfill/CH U","disposal, municipal solid waste, scrubber sludge, to slag compartment/CH U","disposal, municipal solid waste, slag, to slag compartment/CH U","electricity, low voltage, at grid/kWh/CH U for slag descrapping","disposal, municipal solid waste, to municipal incineration with dry RGR/CH U","disposal, municipal solid waste, to municipal incineration with wet RGR/CH U","treatment, fly ash, external acid scrubbing FLUWA/kg/CH U","processing, hydroxid slugde from acid fly ash scrubbing  (waelz process)/kg/DE U","treatment, fly ash, external acid scrubbing FLUREC/kg/CH U","Sodium hydroxide, 50% in H2O, production mix, at plant/RER U","Quicklime, milled, packed, at plant/CH U","Lime, hydrated, packed, at plant/CH U","Sodium chloride, brine solution, at plant/RER U","Hydrochloric acid, 30% in H2O, at plant/RER U","Iron (III) chloride, 40% in H2O, at plant/CH U","Chemicals organic, at plant/GLO U","Chemicals inorganic, at plant/GLO U","Ammonia, liquid, at regional storehouse/CH U","electricity, low voltage, at grid/kWh/CH U","Soda, powder, at plant/RER U","Lignite briquettes, at plant/DE U","Propane/ butane, at refinery/CH U","natural gas, low pressure, at consumer/MJ/CH U","Light fuel oil, at regional storage/CH U","tap water, at user/kg/CH U","Transport, freight, rail/RER U","Transport, lorry 20-28t, fleet average/CH U","disposal, municipal solid waste, fly ash, to underground deposit/kg/CH U","disposal, municipal solid waste,GFresidue, to underground deposit/CH U","Transport, freight, rail/RER U","Transport, lorry 20-28t, fleet average/CH U","Carbon dioxide, fossil, in air","Sulfur dioxide, in air","Nitrogen oxides, in air","Ammonia, in air","Zinc, in air","Particulates, < 2.5 um","Particulates, > 2.5 um, and < 10um"]
["Eingabe 1",null,{"$f":"INDEX(Eingabe!$1:$1048576,MATCH(C$1,Eingabe!$A:$A,0),3)","v":0},{"$f":"INDEX(Eingabe!$1:$1048576,MATCH(D$1,Eingabe!$A:$A,0),3)","v":0},{"$f":"INDEX(Eingabe!$1:$1048576,MATCH(E$1,Eingabe!$A:$A,0),3)","v":0},{"$f":"INDEX(Eingabe!$1:$1048576,MATCH(F$1,Eingabe!$A:$A,0),3)","v":0},{"$f":"INDEX(Eingabe!$1:$1048576,MATCH(G$1,Eingabe!$A:$A,0),3)","v":0},null,null,{"$f":"INDEX(Eingabe!$1:$1048576,MATCH(J$1,Eingabe!$A:$A,0),3)","v":0},{"$f":"INDEX(Eingabe!$1:$1048576,MATCH(K$1,Eingabe!$A:$A,0),3)","v":0},{"$f":"INDEX(Eingabe!$1:$1048576,MATCH(L$1,Eingabe!$A:$A,0),3)","v":0},{"$f":"INDEX(Eingabe!$1:$1048576,MATCH(M$1,Eingabe!$A:$A,0),3)","v":0},{"$f":"INDEX(Eingabe!$1:$1048576,MATCH(N$1,Eingabe!$A:$A,0),3)","v":0},{"$f":"INDEX(Eingabe!$1:$1048576,MATCH(O$1,Eingabe!$A:$A,0),3)","v":0},{"$f":"INDEX(Eingabe!$1:$1048576,MATCH(P$1,Eingabe!$A:$A,0),3)","v":0},{"$f":"INDEX(Eingabe!$1:$1048576,MATCH(Q$1,Eingabe!$A:$A,0),3)","v":0},{"$f":"INDEX(Eingabe!$1:$1048576,MATCH(R$1,Eingabe!$A:$A,0),3)","v":0},{"$f":"INDEX(Eingabe!$1:$1048576,MATCH(S$1,Eingabe!$A:$A,0),3)","v":0},{"$f":"INDEX(Eingabe!$1:$1048576,MATCH(T$1,Eingabe!$A:$A,0),3)","v":0},{"$f":"INDEX(Eingabe!$1:$1048576,MATCH(U$1,Eingabe!$A:$A,0),3)","v":0},{"$f":"INDEX(Eingabe!$1:$1048576,MATCH(V$1,Eingabe!$A:$A,0),3)","v":0},{"$f":"INDEX(Eingabe!$1:$1048576,MATCH(W$1,Eingabe!$A:$A,0),3)","v":0},{"$f":"INDEX(Eingabe!$1:$1048576,MATCH(X$1,Eingabe!$A:$A,0),3)","v":0},{"$f":"INDEX(Eingabe!$1:$1048576,MATCH(Y$1,Eingabe!$A:$A,0),3)","v":0},{"$f":"INDEX(Eingabe!$1:$1048576,MATCH(Z$1,Eingabe!$A:$A,0),3)","v":0},{"$f":"INDEX(Eingabe!$1:$1048576,MATCH(AA$1,Eingabe!$A:$A,0),3)","v":0},{"$f":"INDEX(Eingabe!$1:$1048576,MATCH(AB$1,Eingabe!$A:$A,0),3)","v":0},{"$f":"INDEX(Eingabe!$1:$1048576,MATCH(AC$1,Eingabe!$A:$A,0),3)","v":0},{"$f":"INDEX(Eingabe!$1:$1048576,MATCH(AD$1,Eingabe!$A:$A,0),3)","v":0},{"$f":"INDEX(Eingabe!$1:$1048576,MATCH(AE$1,Eingabe!$A:$A,0),3)","v":0},{"$f":"INDEX(Eingabe!$1:$1048576,MATCH(AF$1,Eingabe!$A:$A,0),3)","v":0},null,null,{"$f":"INDEX(Eingabe!$1:$1048576,MATCH(AI$1,Eingabe!$A:$A,0),3)","v":0},{"$f":"INDEX(Eingabe!$1:$1048576,MATCH(AJ$1,Eingabe!$A:$A,0),3)","v":0},{"$f":"INDEX(Eingabe!$1:$1048576,MATCH(AK$1,Eingabe!$A:$A,0),3)","v":0},{"$f":"INDEX(Eingabe!$1:$1048576,MATCH(AL$1,Eingabe!$A:$A,0),3)","v":0},{"$f":"INDEX(Eingabe!$1:$1048576,MATCH(AM$1,Eingabe!$A:$A,0),3)","v":0},{"$f":"INDEX(Eingabe!$1:$1048576,MATCH(AN$1,Eingabe!$A:$A,0),3)","v":0},{"$f":"INDEX(Eingabe!$1:$1048576,MATCH(AO$1,Eingabe!$A:$A,0),3)","v":0},{"$f":"INDEX(Eingabe!$1:$1048576,MATCH(AP$1,Eingabe!$A:$A,0),3)","v":0},{"$f":"INDEX(Eingabe!$1:$1048576,MATCH(AQ$1,Eingabe!$A:$A,0),3)","v":0},{"$f":"INDEX(Eingabe!$1:$1048576,MATCH(AR$1,Eingabe!$A:$A,0),3)","v":0},{"$f":"INDEX(Eingabe!$1:$1048576,MATCH(AS$1,Eingabe!$A:$A,0),3)","v":0}]
["Eingabe 2",null,{"$f":"INDEX(Eingabe!$1:$1048576,MATCH(C$1,Eingabe!$A:$A,0),4)","v":0},{"$f":"INDEX(Eingabe!$1:$1048576,MATCH(D$2,Eingabe!$A:$A,0),3)","v":0},{"$f":"INDEX(Eingabe!$1:$1048576,MATCH(E$1,Eingabe!$A:$A,0),4)","v":0},{"$f":"INDEX(Eingabe!$1:$1048576,MATCH(F$1,Eingabe!$A:$A,0),4)","v":0},{"$f":"INDEX(Eingabe!$1:$1048576,MATCH(G$1,Eingabe!$A:$A,0),4)","v":0},null,null,{"$f":"INDEX(Eingabe!$1:$1048576,MATCH(J$1,Eingabe!$A:$A,0),4)","v":0},null,{"$f":"INDEX(Eingabe!$1:$1048576,MATCH(L$1,Eingabe!$A:$A,0),4)","v":0},{"$f":"INDEX(Eingabe!$1:$1048576,MATCH(M$1,Eingabe!$A:$A,0),4)","v":0},{"$f":"INDEX(Eingabe!$1:$1048576,MATCH(N$1,Eingabe!$A:$A,0),4)","v":0},{"$f":"INDEX(Eingabe!$1:$1048576,MATCH(O$1,Eingabe!$A:$A,0),4)","v":0},{"$f":"INDEX(Eingabe!$1:$1048576,MATCH(P$1,Eingabe!$A:$A,0),4)","v":0},{"$f":"INDEX(Eingabe!$1:$1048576,MATCH(Q$1,Eingabe!$A:$A,0),4)","v":0},{"$f":"INDEX(Eingabe!$1:$1048576,MATCH(R$1,Eingabe!$A:$A,0),4)","v":0},{"$f":"INDEX(Eingabe!$1:$1048576,MATCH(S$1,Eingabe!$A:$A,0),4)","v":0},{"$f":"INDEX(Eingabe!$1:$1048576,MATCH(T$1,Eingabe!$A:$A,0),4)","v":0},{"$f":"INDEX(Eingabe!$1:$1048576,MATCH(U$1,Eingabe!$A:$A,0),4)","v":0},{"$f":"INDEX(Eingabe!$1:$1048576,MATCH(V$1,Eingabe!$A:$A,0),4)","v":0},{"$f":"INDEX(Eingabe!$1:$1048576,MATCH(W$1,Eingabe!$A:$A,0),4)","v":0},{"$f":"INDEX(Eingabe!$1:$1048576,MATCH(X$1,Eingabe!$A:$A,0),4)","v":0},{"$f":"INDEX(Eingabe!$1:$1048576,MATCH(Y$1,Eingabe!$A:$A,0),4)","v":0},{"$f":"INDEX(Eingabe!$1:$1048576,MATCH(Z$1,Eingabe!$A:$A,0),4)","v":0},null,{"$f":"INDEX(Eingabe!$1:$1048576,MATCH(AB$1,Eingabe!$A:$A,0),4)","v":0},{"$f":"INDEX(Eingabe!$1:$1048576,MATCH(AC$1,Eingabe!$A:$A,0),4)","v":0},null,null,{"$f":"INDEX(Eingabe!$1:$1048576,MATCH(AF$1,Eingabe!$A:$A,0),4)","v":0},null,null,null,{"$f":"INDEX(Eingabe!$1:$1048576,MATCH(AJ$2,Eingabe!$A:$A,0),3)","v":0},{"$f":"INDEX(Eingabe!$1:$1048576,MATCH(AK$1,Eingabe!$A:$A,0),4)","v":0},{"$f":"INDEX(Eingabe!$1:$1048576,MATCH(AL$1,Eingabe!$A:$A,0),4)","v":0},{"$f":"AU65/Ergebnis!$I$24","v":{"$error":"#DIV/0!"}},{"$f":"INDEX(Eingabe!$1:$1048576,MATCH(AN$1,Eingabe!$A:$A,0),4)","v":0},{"$f":"INDEX(Eingabe!$1:$1048576,MATCH(AO$1,Eingabe!$A:$A,0),4)","v":0},{"$f":"INDEX(Eingabe!$1:$1048576,MATCH(AP$1,Eingabe!$A:$A,0),4)","v":0}]
["Umrechnungsfaktor",null,{"$f":"IF(Eingabe!$E$47=TRUE, C4*Eingabe!C12*1000*Ergebnis!$I$24, C4*Eingabe!C12*1000)","v":0},{"$f":"IF(Eingabe!$E$47=TRUE,(D4*Eingabe!$C$12+D5*Eingabe!$C$12)*1000*0.7*Ergebnis!$I$24,(D4*Eingabe!$C$12+D5*Eingabe!$C$12)*1000*0.7)","v":0},{"$f":"IF(Eingabe!$E$47=TRUE,IF(Eingabe!$E$9=E8,E4*Ergebnis!$I$24,0)*1000,IF(Eingabe!$E$9=E8,E4*1,0)*1000)","v":0},{"$f":"IF(Eingabe!$E$47=TRUE,IF(Eingabe!$E$9=F8,F4*Ergebnis!$I$24,0)*1000,IF(Eingabe!$E$9=F8,F4*1,0)*1000)","v":0},{"$f":"IF(Eingabe!$E$47=TRUE,IF(Eingabe!$E$9=G8,G4*Ergebnis!$I$24,0)*1000,IF(Eingabe!$E$9=G8,G4*1,0)*1000)","v":0},{"$f":"IF(Eingabe!$E$47=TRUE,IF(Eingabe!$E$8=H8,(Eingabe!C62+Eingabe!C63)*Eingabe!$C$12*Ergebnis!$I$24,0)*1000,IF(Eingabe!$E$8=H8,Eingabe!C62*Eingabe!$C$12+Eingabe!C63*Eingabe!$C$12,0)*1000)","v":0},{"$f":"IF(Eingabe!$E$47=TRUE,IF(Eingabe!$E$8=I8,(Eingabe!C60+Eingabe!C61)*Eingabe!$C$12*Ergebnis!$I$24,0)*1000,IF(Eingabe!$E$8=I8,Eingabe!C60*Eingabe!$C$12+Eingabe!C61*Eingabe!$C$12,0)*1000)","v":0},{"$f":"IF(Eingabe!$E$47=TRUE,J4*Ergebnis!$I$24*1000-SUM(Prüfwert!F7:J7),J4*1000-SUM(Prüfwert!F7:J7))","v":0},{"$f":"IF(Eingabe!$E$47=TRUE,6.5*K4*Ergebnis!$I$24*0.2,6.5*K4*0.2)","v":0},{"$f":"IF(Eingabe!$E$47=TRUE, IF(Eingabe!$E$8=L8,L4*Ergebnis!$I$24,0)*1000,IF(Eingabe!$E$8=L8,L4*1,0)*1000)","v":0},{"$f":"IF(Eingabe!$E$47=TRUE,IF(Eingabe!$E$8=M8,M4*Ergebnis!$I$24,0)*1000,IF(Eingabe!$E$8=M8,M4*1,0)*1000)","v":0},{"$f":"IF(Eingabe!$E$47=TRUE,IF(Eingabe!$E$60=N8,N4*Eingabe!$C$12*Ergebnis!$I$24,0)*1000*0.02,IF(Eingabe!$E$60=N8,N4*Eingabe!$C$12,0)*1000*0.02)","v":0},{"$f":"IF(Eingabe!$E$47=TRUE,IF(Eingabe!$E$60=O8,O4*Eingabe!$C$12*Ergebnis!$I$24,0)*1000*0.02*0.3,IF(Eingabe!$E$60=O8,O4*Eingabe!$C$12,0)*1000*0.02*0.3)","v":0},{"$f":"IF(Eingabe!$E$47=TRUE,P4*Eingabe!$C$12*Ergebnis!$I$24*1000*0.02,P4*Eingabe!$C$12*1000*0.02)","v":0},{"$f":"IF(Eingabe!$E$47=TRUE, IF(Q4=0,0,Q5*Q4/0.5*Ergebnis!$I$24*1000),IF(Q4=0,0,Q5*Q4/0.5*1000))","v":0},{"$f":"IF(Eingabe!$E$47=TRUE,R4*1000*Ergebnis!$I$24,R4*1000)","v":0},{"$f":"IF(Eingabe!$E$47=TRUE,S4*1000*Ergebnis!$I$24,S4*1000)","v":0},{"$f":"IF(Eingabe!$E$47=TRUE,T4*1000*Ergebnis!$I$24,T4*1000)","v":0},{"$f":"IF(Eingabe!$E$47=TRUE,(U4*U5)*1000*Ergebnis!$I$24,(U4*U5)*1000)","v":0},{"$f":"IF(Eingabe!$E$47=TRUE,V4*V5*1000*Ergebnis!$I$24,V4*V5*1000)","v":0},{"$f":"IF(Eingabe!$E$47=TRUE,(W4*W5)*1000*Ergebnis!$I$24,(W4*W5)*1000)","v":0},{"$f":"IF(Eingabe!$E$47=TRUE,(X4*X5)*1000*Ergebnis!$I$24,(X4*X5)*1000)","v":0},{"$f":"IF(Eingabe!$E$47=TRUE,(Y4*Y5)*1000*Ergebnis!$I$24,(Y4*Y5)*1000)","v":0},{"$f":"IF(Eingabe!$E$47=TRUE,Z4*1000*Ergebnis!$I$24,Z4*1000)","v":0},{"$f":"IF(Eingabe!$E$47=TRUE,AA4*1000*Ergebnis!$I$24,AA4*1000)","v":0},{"$f":"IF(Eingabe!$E$47=TRUE,AB4*1000*Ergebnis!$I$24*19.5,AB4*1000*19.5)","v":0},{"$f":"IF(Eingabe!$E$47=TRUE,(AC4*Ergebnis!$I$24),(AC4))","v":0},{"$f":"IF(Eingabe!$E$47=TRUE,AD4*37.8*Ergebnis!$I$24,AD4*37.8)","v":0},{"$f":"IF(Eingabe!$E$47=TRUE,AE4*0.86*Ergebnis!$I$24,AE4*0.86)","v":0},{"$f":"IF(Eingabe!$E$47=TRUE,AF4*Ergebnis!$I$24,AF4)","v":0},{"$f":"($Q$6+$R$6+$S$6+$T$6+$U$6+$V$6+$W$6+$X$6+$Y$6+$AA$6+$AC$6)/1000*600","v":0},{"$f":"($Q$6+$R$6+$S$6+$T$6+$U$6+$V$6+$W$6+$X$6+$Y$6+$AA$6+$AC$6)/1000*100","v":0},{"$f":"IF(Eingabe!$E$47=TRUE,AI4*Eingabe!C12*1000*Ergebnis!$I$24,AI4*Eingabe!C12*1000)","v":0},{"$f":"IF(Eingabe!$E$47=TRUE,IF(AJ4=0,0,AJ5/(AJ4*Ergebnis!$I$24)/0.00542286213268479),IF(AJ4=0,0,AJ5/AJ4/0.00542286213268479))","v":0},{"$f":"IF(Eingabe!$E$47=TRUE, AK4*Ergebnis!$I$24*AK5,AK4*AK5)","v":0},{"$f":"IF(Eingabe!$E$47=TRUE, AL4*Ergebnis!$I$24*AL5,AL4*AL5)","v":0},{"$f":"IF(Eingabe!E47=TRUE,AV65/AU65*AM5*AM4*Ergebnis!$I$24*1000+AE6*42.6*0.074+AD6*0.056+AC6/0.952*24.48*0.0654,AM4*1000*AV65+AE6*42.6*0.074+AD6*0.056+AC6/0.952*24.48*0.0654)","v":0},{"$f":"IF(Eingabe!$E$47=TRUE,AN4*Ergebnis!$I$24,AN4)","v":0},{"$f":"IF(Eingabe!$E$47=TRUE,AO4*Ergebnis!$I$24,AO4)","v":0},{"$f":"IF(Eingabe!$E$47=TRUE,AP4*Ergebnis!$I$24,AP4)","v":0},{"$f":"IF(Eingabe!$E$47=TRUE,IF(AQ4>0,AQ4*Ergebnis!$I$24,5.3*10^-7*Eingabe!C12*Ergebnis!$I$24*1000),IF(AQ4>0,AQ4,5.3*10^-7*Eingabe!C12*1000))","v":0},{"$f":"IF(Eingabe!$E$47=TRUE,IF(AR4>0,AR4*0.995*Ergebnis!$I$24,0.00000597*Eingabe!C12*Ergebnis!$I$24*1000),IF(AR4>0,AR4*0.995,0.00000597*Eingabe!C12*1000))","v":0},{"$f":"IF(Eingabe!$E$47=TRUE,IF(AS4>0,AS4*0.005*Ergebnis!$I$24,0.00000003*Eingabe!C12*Ergebnis!$I$24*1000),IF(AS4>0,AS4*0.005,0.00000003*Eingabe!C12*1000))","v":0}]
["Rauchgasreinigung"]
["DeNOx Technologie",null,null,null,2,1,3,1,1,null,null,2,1,2,1]
["EI'99-aggregated, Hierarchist",{"$f":"SUM(C9:AS9)","v":0},{"$f":"C$63*C$6","v":0},{"$f":"D$63*D$6","v":0},0,0,0,0,0,0,0,0,0,{"$f":"N$63*N$6","v":0},0,0,0,0,0,0,0,0,0,0,0,0,0,0,0,0,0,0,0,0,0,0,0,0,{"$f":"0.0095844*AM6","v":0},{"$f":"2.5647307*AN6","v":0},{"$f":"4.447721*AO6","v":0},{"$f":"4.9680544*AP6","v":0},{"$f":"202.0688*AQ6","v":0},{"$f":"32.394359*AR6","v":0},{"$f":"17.115*AS6","v":0}]
["Klimawandel",{"$f":"SUM(C10:AS10)","v":0},{"$f":"C$116*C$6","v":0},0,0,0,0,0,0,0,0,0,0,0,0,0,0,0,0,0,0,0,0,0,0,0,0,0,0,0,0,0,0,0,0,0,0,0,{"$f":"1*AM6","v":0},0,0,0,0,0,0]
{"$rows_left_out":241}
{"sheet":"Prüfwert","index":5,"n_rows":77,"n_cols":13,"rows_kept":77,"cut":false,"hidden":true,"merged":[[6,0,6,1],[7,0,7,1]]}
["Referenz",null,1,2,3,4,5,6,7,8,9,10,11]
[null,null,"Grenzwert Strom","Grenzwert Wärme","Grenzwert Entsorgungsfunktion","Grenzwert Primäraluminium","Grenzwert Primärkupfer","Grenzwert Primär-Gold","Grenzwert Primär-Edelstahl","Grenzwert Roheisen","Grenzwert Primärzink","Grenzwert Zinkkonzentrat","Grenzwert Bleikonzentrat"]
["Zeile 1 ",null,30,31,12,34,33,36,35,32,38,37,37]
["Zeile 2",{"$nulls":4},49,49,null,50,50,null,38,38]
["Eingabe 1",null,{"$f":"INDEX(Eingabe!$1:$1048576,MATCH(C$3,Eingabe!$A:$A,0),3)","v":0},{"$f":"INDEX(Eingabe!$1:$1048576,MATCH(D$3,Eingabe!$A:$A,0),3)","v":0},{"$f":"INDEX(Eingabe!$1:$1048576,MATCH(E$3,Eingabe!$A:$A,0),3)","v":0},{"$f":"INDEX(Eingabe!$1:$1048576,MATCH(F$3,Eingabe!$A:$A,0),3)","v":0},{"$f":"INDEX(Eingabe!$1:$1048576,MATCH(G$3,Eingabe!$A:$A,0),3)","v":0},{"$f":"INDEX(Eingabe!$1:$1048576,MATCH(H$3,Eingabe!$A:$A,0),3)","v":0},{"$f":"INDEX(Eingabe!$1:$1048576,MATCH(I$3,Eingabe!$A:$A,0),3)","v":0},{"$f":"INDEX(Eingabe!$1:$1048576,MATCH(J$3,Eingabe!$A:$A,0),3)","v":0},{"$f":"INDEX(Eingabe!$1:$1048576,MATCH(K$3,Eingabe!$A:$A,0),3)","v":0},{"$f":"INDEX(Eingabe!$1:$1048576,MATCH(L$3,Eingabe!$A:$A,0),3)","v":0},{"$f":"INDEX(Eingabe!$1:$1048576,MATCH(M$3,Eingabe!$A:$A,0),3)","v":0}]
["Eingabe 2",{"$nulls":4},{"$f":"INDEX(Eingabe!$1:$1048576,MATCH(F$4,Eingabe!$A:$A,0),3)","v":0},{"$f":"INDEX(Eingabe!$1:$1048576,MATCH(G$4,Eingabe!$A:$A,0),3)","v":0},null,{"$f":"INDEX(Eingabe!$1:$1048576,MATCH(I$4,Eingabe!$A:$A,0),3)","v":0},{"$f":"INDEX(Eingabe!$1:$1048576,MATCH(J$4,Eingabe!$A:$A,0),3)","v":0},null,{"$f":"INDEX(Eingabe!$1:$1048576,MATCH(L$4,Eingabe!$A:$A,0),3)","v":0},{"$f":"INDEX(Eingabe!$1:$1048576,MATCH(M$4,Eingabe!$A:$A,0),3)","v":0}]
["Umrechnungsfaktor",null,{"$f":"IF(Eingabe!$E$47=TRUE,C5*0.5*1000,C5*1000)","v":0},{"$f":"D5*1000","v":0},{"$f":"IF(Eingabe!$E$47=TRUE,E5*Ergebnis!$I$24*1000,E5*1000)","v":0},{"$f":"IF(Eingabe!$E$47=TRUE,IF(F5>0,F5*0.97003745*Ergebnis!$I$24*1000,F6*0.75730994*Ergebnis!$I$24*1000),IF(F5>0,F5*0.97003745*1000,F6*0.75730994*1000))","v":0},{"$f":"IF(Eingabe!$E$47=TRUE,IF(G5>0,G5*0.7733333*Ergebnis!$I$24*1000,G6*0.16959064*Ergebnis!$I$24*1000),IF(G5>0,G5*0.7733333*1000,G6*0.16959064*1000))","v":0},{"$f":"IF(Eingabe!$E$47=TRUE,H5*Ergebnis!$I$24*1000,H5*1000)","v":0},{"$f":"IF(Eingabe!$E$47=TRUE,IF(I5>0,I5*0.91428571*Ergebnis!$I$24*1000,I6*0.02044728*Ergebnis!$I$24*1000),IF(I5>0,I5*0.91428571*1000,I6*0.02044728*1000))","v":0},{"$f":"IF(Eingabe!$E$47=TRUE,IF(J5>0,J5*Ergebnis!$I$24*1000,J6*0.97763578*Ergebnis!$I$24*1000),IF(J5>0,J5*1000,J6*0.97763578*1000))","v":0},{"$f":"IF(Eingabe!$E$47=TRUE,K5*0.000954*Eingabe!$C$12*Ergebnis!$I$24*1000,K5*0.000954*Eingabe!$C$12*1000)","v":0},{"$f":"IF(Eingabe!$E$47=TRUE,L5*0.0010336*Eingabe!$C$12*Ergebnis!$I$24*1000+L6*0.0000256*Eingabe!$C$12*Ergebnis!$I$24*1000,L5*0.0010336*Eingabe!$C$12*1000+L6*0.0000256*Eingabe!$C$12*1000)","v":0},{"$f":"IF(Eingabe!$E$47=TRUE,M5*0.0002176*Eingabe!$C$12*Ergebnis!$I$24*1000+M6*0.0002176*Eingabe!$C$12*Ergebnis!$I$24*1000,M5*0.0002176*Eingabe!$C$12*1000+M6*0.0002176*Eingabe!$C$12*1000)","v":0}]
["EI'99-aggregated, Hierarchist",null,{"$f":"-C$7*C$39","v":0},{"$f":"-D$7*D$39","v":0},{"$f":"-E$7*L$39","v":0},{"$f":"-F$7*G$39","v":0},{"$f":"-G$7*H$39","v":0},{"$f":"-H$7*I$39","v":0},{"$f":"-I$7*J$39","v":0},{"$f":"-J$7*F$39","v":0},{"$f":"-K$7*K$39","v":0},{"$f":"-L$7*M$39","v":0},{"$f":"-M$7*E$39","v":0}]
[]
[]
{"$rows_left_out":68}
{"sheet":"Ergebnis pro Tonne","index":6,"n_rows":73,"n_cols":9,"rows_kept":73,"cut":false,"hidden":false,"merged":[[0,5,1,5],[0,6,1,6],[4,5,5,5],[4,6,5,7]]}
[{"$nulls":5},{"$f":"G11","v":0},{"$f":"H11","v":0}]
[]
[null," Umweltbelastung pro Tonne Abfall","Allokation der Umweltbelastung auf die Produkte","Prüfwert",null,null,"Umweltbelastung pro Tonne Abfall","Prüfwert"]
[{"$f":"Umweltdeklaration!$B5","v":"KVA (inkl. direkte Emissionen)"},{"$f":"Umweltdeklaration!H5/$G$18","v":{"$error":"#DIV/0!"}},null,null,null,"EI'99-aggregated, Hierarchist",{"$f":"B27","v":{"$error":"#DIV/0!"}},{"$f":"D27","v":{"$error":"#DIV/0!"}}]
[{"$f":"Umweltdeklaration!$B6","v":"Hilfsstoffe + importierte Energieträger"},{"$f":"Umweltdeklaration!H6/$G$18","v":{"$error":"#DIV/0!"}},null,null,null,{"$f":"IF(G5<=1,I6,I7)","v":{"$error":"#DIV/0!"}},{"$f":"G4/H4","v":{"$error":"#DIV/0!"}}]
[{"$f":"Umweltdeklaration!$B7","v":"Behandlung Flugasche (inkl. Deponie)"},{"$f":"Umweltdeklaration!H7/$G$18","v":{"$error":"#DIV/0!"}},{"$nulls":6},"Kriterium GK-KVA1 Grenzwert Umweltbelastung erfüllt"]
[{"$f":"Umweltdeklaration!$B8","v":"Deponierung Bodenasche"},{"$f":"Umweltdeklaration!H8/$G$18","v":{"$error":"#DIV/0!"}},{"$nulls":6},"Kriterium GK-KVA1 Grenzwert Umweltbelastung nicht erfüllt"]
[{"$nulls":5},"Kriterium Energienettoeffizienz ENE","Energie-nettoeffizienz ENE","Prüfwert"]
[{"$nulls":5},{"$f":"IF(G9>100%,I11,IF(G9>=H9,I9,I10))","v":{"$error":"#DIV/0!"}},{"$f":"Prüfwert!C77","v":{"$error":"#DIV/0!"}},0.65,"Kriterium LK-KVA5 Energienettoeffizienz ENE erfüllt"]
[{"$nulls":8},"Kriterium LK-KVA5 Energienettoeffizienz ENE nicht erfüllt"]
{"$rows_left_out":63}