{"text_format":"2","workbook":"xlsx","n_sheets":7,"sheets":["Info","Eingabe","Ergebnis","Umweltdeklaration","LCIA","Prüfwert","Ergebnis pro Tonne"],"not_rendered":{"charts":2,"images":1,"macros":0,"external_links":0,"defined_names":26,"comments":2,"pivot_tables":0},"unopened":[],"bounds":{"document_bytes":16777216,"sheet_cells":100000,"run_cost":"one","rows_first":2000,"rows_last":500,"rows_between":2000,"halvings":0,"cell_chars":16384,"cell_head_chars":4096},"cells_cut":0,"cells_raw":0,"read":"whole","date_system":"1900"}

{"sheet":"Info","index":0,"n_rows":35,"n_cols":1,"rows_kept":35,"cut":false,"hidden":false,"merged":[[31,0,31,1],[32,0,32,1]]}
[]
[{"$f":"Eingabe!B2","v":"Naturemade \"Recycling Star\" Prüfung"}]
["Kennwertmodell erstellt durch Livia Ramseier, treeze Ltd., März 2020"]
[]
["Anleitung"]
["Alle hellen Felder im Blatt „Eingabe“ müssen ausgefüllt werden. Bei Eingabe einer Null erscheint die für die Eingabe geforderte Einheit. Aus den Drop-Down Menüs müssen die passenden Anlagenspezifikationen ausgewählt werden."]
["Die automatische Berechnung in Excel muss eingeschaltet sein (/Extras/Optionen/Berechnung --> automatisch) oder man kann mit der [F9] Taste jeweils Formeln neu berechnen lassen."]
["Alle Angaben müssen für ein Jahr eingegeben werden."]
[]
["Umweltdeklaration"]
["Die Umweltdeklaration weist die Umweltbelastung einer Kehrrichtverbrennungsanlage grob aus. Dabei werden die Umweltindikatoren Eco-indicator 99, Klimawandel 2013, Nicht-erneuerbarer Energiebedarf (fossil, nuklear) und ökologische Knappheit 2013 berechnet. "]
["Im Block links oben wird die Umweltdeklaration der Anlage in verschiedene Teilbereiche aufgeteilt. Rechts oben stehen die Gesamtbelastungen pro Jahr für die vier verschiedenen Umweltindikatoren und die verschiedenen Teilbereiche der Anlage. Im Prüfwert-Block wird die erlaubte Umweltbelastung der gesamten Anlage in Eco-Indicator 99 Punkten angegeben (zum Beispiel 1‘226‘003 Pkt, 100 %) und deren Aufteilung auf die Menge der erzeugten Energie und der zurückgewonnenen Metalle . Rechts unten wird die Umweltdeklaration der Anlage mit den Belastungen der erzeugten Energie pro kWh und der zurückgewonnenen Metalle pro kg gezeigt."]
[]
["Ergebnis"]
["Das Ergebnisblatt des Kennwertmodells besteht aus einer Graphik, welche die totale Umweltbelastung aufgeteilt in die einzelnen Teilbereiche, die Allokation der Umweltbelastung auf die einzelnen Produkte, sowie den Prüfwert als Summe der Grenzwerte einer Anlage in Eco-indicator-Punkte aufzeigt. Rechts daneben liegt eine Charakterisierung der Anlage vor, welche auf die Angaben im Eingabeblatt zurückgreift. Die Differenz zwischen der totalen Umweltbelastung und dem Prüfwert wird berechnet und gibt Auskunft darüber, ob eine Anlage das “Recycling star“ Label erfüllt oder nicht."]
[]
["Rückfragen"]
["Bei Fragen und Rückmeldungen wenden Sie sich bitte an die naturemade Geschäftsstelle. Bitte schicken Sie hierzu die ausgefüllte Excel-Tabelle, abgespeichert unter neuem Namen unter Beibehaltung der Versionennummer an folgende Adresse:"]
[]
["Verein für umweltgerechte Energie VUE naturemade"]
["Valentin Graf"]
["Molkenstrasse 21"]
["8004 Zürich"]
["valentin.graf@naturemade.ch "]
["Tel +41 44 213 10 21"]
[]
[]
[]
["Entwicklung und Auftragnehmer:"]
["Livia Ramseier"]
["Rolf Frischknecht"]
["treeze Ltd.\nKanzleistrasse 4, 8610 Uster"]
["info@treeze.ch"]
["Tel: 044 940 61 90"]
["www.treeze.ch"]

{"sheet":"Eingabe","index":1,"n_rows":77,"n_cols":7,"rows_kept":77,"cut":false,"hidden":false,"merged":[[1,1,1,3]]}
[null,null,41,42]
[null,"Naturemade \"Recycling Star\" Prüfung"]
[]
[null,"KVA (Name / Standort)"]
[null,"Bezugsjahr"]
[]
[null,"Anlagetyp"]
[null,"Rauchgasreinigung",null,null,1]
[null,"DeNOx Technologie",null,null,2]
[]
[null,"Bezugsmenge","[Tonnen/Jahr]"]
[12,"Abfallmenge (Gesamt) Verbranntemenge",0]
[]
[null,"Heizwert","[MJ/kg]"]
[54,"Durchschnittlicher unterer Heizwert Abfall",0,{"$f":"IF(C15=0,\"Pflichtfeld: Bitte geben Sie den Heizwert ein\",\"\")","v":"Pflichtfeld: Bitte geben Sie den Heizwert ein"}]
[]
[null,"Abfallimport aus Ausland","[Tonnen/Jahr]","Durchschnittliche Distanz [km]"]
[52,"Importierte Menge per Bahn",0,0]
[53,"Importierte Menge per LKW",0,0]
[]
[null,"Hilfsstoffe Total","[Menge/Jahr]","Konzentration"]
[13,"Natronlauge",0,0]
[14,"NaHCO3 / Natriumbicarbonat / Natron",0]
[15,"Ammoniak",0,0]
[16,"Salzsäure",0,0]
[18,"FeCl3",0,0]
[17,"CaO",0]
[47,"Kalkhydrat Ca(OH)2",0]
[48,"Salzsole, gesättigt",0]
[19,"Adsorbensmittel (Herdofenkoks)",0,null,null,null,"                                                                                                                                                                                                                                                                                                                                                                                                                                                                                                                                                                                                                                                                                                                                                                                                                                                                                                                                                                                                                                                                                                                                                                                                                                                                                                                                                                                                                                                                                                                                                                                                                                                                                                                                                                                                                                                                                                                                                                                                                                                                                                                                                                                                                                                  "]
[21,"Andere Chemikalien (organisch; zB. TMT)",0,0]
[43,"Andere Chemikalien (anorganisch) Wasserstoffperoxid",0,0]
[22,"Wasser (Frischwasserverbrauch)",0]
[23,"Strombezug aus Netz",0]
[20,"Propangas Bezug",0]
[45,"Erdgas Bezug",0]
[46,"Heizöl Bezug",0]
[]
[null,"Emissionen in Luft","[kg/Jahr]"]
[26,"Partikel (PM)    ",0,"(falls nicht bekannt; default: 6*10-6 kg/ kg Abfall)"]
[27,"Schwefeldioxid (SO2)",0]
[28,"Stickoxide (NOx)",0]
[29,"Ammoniak (NH3)",0]
[51,"Zink (Zn)",0,"(falls nicht bekannt; default: 5.30*10-7 kg/ kg Abfall)"]
[]
[null,"Energierückgewinnung","[MWh/Jahr]"]
[30,"Strom Verkaufsmenge (inkl. Regelleistung)",0,null,false]
[31,"Wärme/Dampf Verkaufsmenge",0]
[]
[null,"Metallrückgewinnung aus Schlacke","[Tonnen/Jahr]"]
[32,"Eisen",0]
[33,"Kupfer",0]
[34,"Aluminium",0]
[35,"Edelstahl",0]
[36,"Gold",0]
[49,"Nichteisenmetalle (Total an Kupfer und Aluminium)",0,"(nur falls keine Differenzierung möglich)"]
[50,"Eisenmetalle (Total an Eisen und Edelstahl)",0,"(nur falls keine Differenzierung möglich)"]
[]
[null,"Behandlung der Flugasche","Anteil Flugasche"]
[37,"FLUWA",0,null,1]
[38,"FLUREC (extern)",0]
[39,"Unbehandelt auf Reststoffdeponie (Verfestigung mit Zement) ",0]
[40,"Unbehandelt auf Untertagedeponie ",0]
[null,"Total",{"$f":"SUM(C60:C63)","v":0}]
[]
[null,"Deponierung von Gewebefilter Rückständen","[Tonnen/Jahr]"]
[44,"Untertagedeponie",0]
[]
[]
[]
[null,"nass"]
[null,"trocken"]
[null,"SCR low dust"]
[null,"SCR high dust"]
[null,"SNCR"]
[null,"intern"]
[null,"extern"]

{"sheet":"Ergebnis","index":2,"n_rows":73,"n_cols":9,"rows_kept":73,"cut":false,"hidden":false,"merged":[[4,6,5,7],[0,5,1,5],[0,6,1,6],[4,5,5,5]]}
[{"$nulls":5},{"$f":"G11","v":0},{"$f":"H11","v":0}]
[]
[null," Umweltbelastung absolut","Allokation der Umweltbelastung auf die Produkte","Prüfwert",null,null,"Umweltbelastung absolut","Prüfwert"]
[{"$f":"Umweltdeklaration!$B5","v":"KVA (inkl. direkte Emissionen)"},{"$f":"Umweltdeklaration!H5","v":0},null,null,null,"EI'99-aggregated, Hierarchist",{"$f":"$B27","v":0},{"$f":"$D27","v":0}]
[{"$f":"Umweltdeklaration!$B6","v":"Hilfsstoffe + importierte Energieträger"},{"$f":"Umweltdeklaration!H6","v":0},null,null,null,{"$f":"IF(G5<=1,I6,I7)","v":{"$error":"#DIV/0!"}},{"$f":"G4/H4","v":{"$error":"#DIV/0!"}}]
[{"$f":"Umweltdeklaration!$B7","v":"Behandlung Flugasche (inkl. Deponie)"},{"$f":"Umweltdeklaration!H7","v":0},{"$nulls":6},"Kriterium GK-KVA1 Grenzwert Umweltbelastung erfüllt"]
[{"$f":"Umweltdeklaration!$B8","v":"Deponierung Bodenasche"},{"$f":"Umweltdeklaration!H8","v":0},{"$nulls":6},"Kriterium GK-KVA1 Grenzwert Umweltbelastung nicht erfüllt"]
[{"$nulls":5},"Kriterium Energienettoeffizienz ENE","Energie-nettoeffizienz ENE","Prüfwert"]
[{"$nulls":5},{"$f":"IF(G9>100%,I11,IF(G9>=H9,I9,I10))","v":{"$error":"#DIV/0!"}},{"$f":"Prüfwert!C77","v":{"$error":"#DIV/0!"}},0.65,"Kriterium LK-KVA5 Energienettoeffizienz ENE erfüllt"]
[{"$nulls":8},"Kriterium LK-KVA5 Energienettoeffizienz ENE nicht erfüllt"]
[{"$f":"Umweltdeklaration!$B9","v":"Deponierung Gewebefilterrückstände"},{"$f":"Umweltdeklaration!H9","v":0},null,null,null,"Charakterisierung der ",{"$f":"Eingabe!C4","v":0},{"$f":"Eingabe!C5","v":0},"Bitte überprüfen Sie die Eingaben"]
[{"$f":"Umweltdeklaration!$B14","v":"Strom"},null,{"$f":"D12*$B$27/$D$27","v":{"$error":"#DIV/0!"}},{"$f":"Umweltdeklaration!$D14","v":0}]
[{"$f":"Umweltdeklaration!$B15","v":"Wärme"},null,{"$f":"D13*$B$27/$D$27","v":{"$error":"#DIV/0!"}},{"$f":"Umweltdeklaration!$D15","v":0},null,"Anlagetyp",null,null,"nass"]
[{"$f":"Umweltdeklaration!$B16","v":"Entsorgungsfunktion"},null,{"$f":"D14*$B$27/$D$27","v":{"$error":"#DIV/0!"}},{"$f":"Umweltdeklaration!$D16","v":0},null,"Rauchgasreinigung",{"$f":"IF(Anlagentyp=1,I13,I14)","v":"nass"},null,"trocken"]
[{"$f":"Umweltdeklaration!$B17","v":"Sekundäraluminium, kg"},null,{"$error":"#DIV/0!"},{"$f":"Umweltdeklaration!$D17","v":0},null,"DeNOx Technologie",{"$f":"IF(Eingabe!E9=1,I15,IF(Eingabe!E9=2,I16,I17))","v":"SCR high dust"},null,"SCR low dust"]
[{"$f":"Umweltdeklaration!$B18","v":"Sekundärkupfer, kg"},null,{"$error":"#DIV/0!"},{"$f":"Umweltdeklaration!$D18","v":0},{"$nulls":4},"SCR high dust"]
[{"$f":"Umweltdeklaration!$B19","v":"Sekundär-Gold, kg"},null,{"$error":"#DIV/0!"},{"$f":"Umweltdeklaration!$D19","v":0},null,"Bezugsmenge","[Tonnen/Jahr]",null,"SNCR"]
[{"$f":"Umweltdeklaration!$B20","v":"Sekundär-Edelstahl, kg"},null,{"$error":"#DIV/0!"},{"$f":"Umweltdeklaration!$D20","v":0},null,"Abfallmenge",{"$f":"IF(Eingabe!$E$47=TRUE,Eingabe!C12*$I$24,Eingabe!C12)","v":0}]
[]
[{"$nulls":5},"Heizwert","[MJ/kg]"]
[{"$nulls":5},"Durchschnittliche unterer Heizwert Abfall",{"$f":"Eingabe!C15","v":0}]
[]
[{"$f":"Umweltdeklaration!$B21","v":"Eisenschrott, kg"},null,{"$error":"#DIV/0!"},{"$f":"Umweltdeklaration!$D21","v":0},null,"Abfallimport aus Ausland","[Tonnen/Jahr]","Durchschnittliche Distanz [km]",{"$f":"(0.5*3*Eingabe!C47)/(3*Eingabe!C47+Eingabe!C48)","v":{"$error":"#DIV/0!"}}]
[{"$f":"Umweltdeklaration!$B22","v":"Sekundärzink, kg"},null,{"$error":"#DIV/0!"},{"$f":"Umweltdeklaration!$D22","v":0},null,"Importierte Menge per Bahn",{"$f":"IF(Eingabe!$E$47=TRUE,Eingabe!C18*$I$24,Eingabe!C18)","v":0},{"$f":"Eingabe!$D18","v":0},{"$f":"1-I23","v":{"$error":"#DIV/0!"}}]
[{"$f":"Umweltdeklaration!$B23","v":"Sekundär-Zinkkonzentrat, kg"},null,{"$error":"#DIV/0!"},{"$f":"Umweltdeklaration!$D23","v":0},null,"Importierte Menge per LKW",{"$f":"IF(Eingabe!$E$47=TRUE,Eingabe!C19*$I$24,Eingabe!C19)","v":0},{"$f":"Eingabe!$D19","v":0}]
[{"$f":"Umweltdeklaration!$B24","v":"Sekundär-Bleikonzentrat, kg"},null,{"$error":"#DIV/0!"},{"$f":"Umweltdeklaration!$D24","v":0}]
["TOTAL",{"$f":"SUM(B4:B11)","v":0},{"$f":"SUM(C12:C26)","v":{"$error":"#DIV/0!"}},{"$f":"SUM(D12:D26)","v":0},null,"Hilfsstoffe Total","[Menge/Jahr]","Konzentration"]
[{"$nulls":5},"Natronlauge",{"$f":"IF(Eingabe!$E$47=TRUE,Eingabe!C22*$I$24,Eingabe!C22)","v":0},{"$f":"Eingabe!$D22","v":0}]
[{"$nulls":5},"NaHCO3 / Natriumbicarbonat / Natron",{"$f":"IF(Eingabe!$E$47=TRUE,Eingabe!C23*$I$24,Eingabe!C23)","v":0}]
[{"$nulls":5},"Ammoniak",{"$f":"IF(Eingabe!$E$47=TRUE,Eingabe!C24*$I$24,Eingabe!C24)","v":0},{"$f":"Eingabe!$D24","v":0}]
[{"$nulls":5},"Salzsäure",{"$f":"IF(Eingabe!$E$47=TRUE,Eingabe!C25*$I$24,Eingabe!C25)","v":0},{"$f":"Eingabe!$D25","v":0}]
[{"$nulls":5},"FeCl3",{"$f":"IF(Eingabe!$E$47=TRUE,Eingabe!C26*$I$24,Eingabe!C26)","v":0},{"$f":"Eingabe!$D26","v":0}]
[{"$nulls":5},"CaO",{"$f":"IF(Eingabe!$E$47=TRUE,Eingabe!C27*$I$24,Eingabe!C27)","v":0}]
[{"$nulls":5},"Kalkhydrat Ca(OH)2",{"$f":"IF(Eingabe!$E$47=TRUE,Eingabe!C28*$I$24,Eingabe!C28)","v":0}]
[{"$nulls":5},"Salzsole, gesättigt",{"$f":"IF(Eingabe!$E$47=TRUE,Eingabe!C29*$I$24,Eingabe!C29)","v":0}]
[{"$nulls":5},"Adsorbensmittel (Herdofenkoks)",{"$f":"IF(Eingabe!$E$47=TRUE,Eingabe!C30*$I$24,Eingabe!C30)","v":0}]
[{"$nulls":5},"Andere Chemikalien (organisch; zB. TMT)",{"$f":"IF(Eingabe!$E$47=TRUE,Eingabe!C31*$I$24,Eingabe!C31)","v":0},{"$f":"Eingabe!$D31","v":0}]
[{"$nulls":5},"Andere Chemikalien (anorganisch)",{"$f":"IF(Eingabe!$E$47=TRUE,Eingabe!C32*$I$24,Eingabe!C32)","v":0},{"$f":"Eingabe!$D32","v":0}]
[{"$nulls":5},"Wasser",{"$f":"IF(Eingabe!$E$47=TRUE,Eingabe!C33*$I$24,Eingabe!C33)","v":0}]
[{"$nulls":5},"Strombezug aus Netz",{"$f":"IF(Eingabe!$E$47=TRUE,Eingabe!C34*$I$24,Eingabe!C34)","v":0}]
[{"$nulls":5},"Propangas Bezug",{"$f":"IF(Eingabe!$E$47=TRUE,Eingabe!C35*$I$24,Eingabe!C35)","v":0}]
[{"$nulls":5},"Erdgas Bezug",{"$f":"IF(Eingabe!$E$47=TRUE,Eingabe!C36*$I$24,Eingabe!C36)","v":0}]
[{"$nulls":5},"Heizöl Bezug",{"$f":"IF(Eingabe!$E$47=TRUE,Eingabe!C37*$I$24,Eingabe!C37)","v":0}]
[]
[{"$nulls":5},"Emissionen in Luft","[kg/Jahr]"]
[{"$nulls":5},"Partikel (PM)",{"$f":"IF(Eingabe!$E$47=TRUE,Eingabe!C40*$I$24,Eingabe!C40)","v":0}]
[{"$nulls":5},"Schwefeldioxid (SO2)",{"$f":"IF(Eingabe!$E$47=TRUE,Eingabe!C41*$I$24,Eingabe!C41)","v":0}]
[{"$nulls":5},"Stickoxide (NOx)",{"$f":"IF(Eingabe!$E$47=TRUE,Eingabe!C42*$I$24,Eingabe!C42)","v":0}]
[{"$nulls":5},"Ammoniak (NH3)",{"$f":"IF(Eingabe!$E$47=TRUE,Eingabe!C43*$I$24,Eingabe!C43)","v":0}]
[{"$nulls":5},"Zink (Zn)",{"$f":"IF(Eingabe!$E$47=TRUE,Eingabe!C44*$I$24,Eingabe!C44)","v":0}]
[]
[{"$nulls":5},"Energierückgewinnung","[MWh/Jahr]"]
[{"$nulls":5},"Strom Verkaufsmenge (inkl. Regelleistung)",{"$f":"IF(Eingabe!$E$47=TRUE,Eingabe!C47*0.5,Eingabe!C47)","v":0}]
[{"$nulls":5},"Wärme/Dampf Verkaufsmenge",{"$f":"Eingabe!C48","v":0}]
[]
[{"$nulls":5},"Metallrückgewinnung aus Schlacke","[Tonnen/Jahr]"]
[{"$nulls":5},"Eisen",{"$f":"IF(Eingabe!$E$47=TRUE,Eingabe!C51*$I$24,Eingabe!C51)","v":0}]
[{"$nulls":5},"Kupfer",{"$f":"IF(Eingabe!$E$47=TRUE,Eingabe!C52*$I$24,Eingabe!C52)","v":0},null,"intern"]
[{"$nulls":5},"Aluminium",{"$f":"IF(Eingabe!$E$47=TRUE,Eingabe!C53*$I$24,Eingabe!C53)","v":0}]
[{"$nulls":5},"Edelstahl",{"$f":"IF(Eingabe!$E$47=TRUE,Eingabe!C54*$I$24,Eingabe!C54)","v":0}]
[{"$nulls":5},"Gold",{"$f":"IF(Eingabe!$E$47=TRUE,Eingabe!C55*$I$24,Eingabe!C55)","v":0},null,"extern"]
[{"$nulls":5},"Nichteisenmetalle (Total an Kupfer und Aluminium)",{"$f":"IF(Eingabe!$E$47=TRUE,Eingabe!C56*$I$24,Eingabe!C56)","v":0}]
[{"$nulls":5},"Eisenmetalle (Total an Eisen und Edelstahl)",{"$f":"IF(Eingabe!$E$47=TRUE,Eingabe!C57*$I$24,Eingabe!C57)","v":0}]
[]
[{"$nulls":5},"Behandlung der Flugasche","Anteil Flugasche"]
[{"$nulls":5},"FLUWA",{"$f":"Eingabe!C60","v":0},{"$f":"IF(Eingabe!E60=1,Ergebnis!I58,I61)","v":"intern"}]
[{"$nulls":5},"FLUREC (extern)",{"$f":"Eingabe!C61","v":0}]
[{"$nulls":5},"Unbehandelt auf Reststoffdeponie (Verfestigung mit Zement) ",{"$f":"Eingabe!C62","v":0}]
[{"$nulls":5},"Unbehandelt auf Untertagedeponie ",{"$f":"Eingabe!C63","v":0}]
[{"$nulls":5},"Total",{"$f":"SUM(G66:G69)","v":0}]
[]
[{"$nulls":5},"Deponierung von Gewebefilter Rückständen","[Tonnen/Jahr]"]
[{"$nulls":5},"Untertagedeponie",{"$f":"IF(Eingabe!$E$47=TRUE,Eingabe!C67*$I$24,Eingabe!C67)","v":0}]

{"sheet":"Umweltdeklaration","index":3,"n_rows":25,"n_cols":11,"rows_kept":25,"cut":false,"hidden":false,"merged":[]}
[{"$nulls":7},29,35,34,31]
[null,"Verbrennung von Siedlungsabfall in",{"$f":"Eingabe!C4","v":0},"EI'99-aggregated, Hierarchist","Anteil",null,null,"EI'99-aggregated, Hierarchist","Klimawandel","KEA, ne","ökologische Knappheit"]
[null,null,null,"Pkt",null,null,null,"Pkt","kg CO2-eq","MJ-eq","UBP 13 Pkte"]
[null,"Import von Abfall",null,null,{"$f":"H4/H$10","v":{"$error":"#DIV/0!"}},null,null,{"$f":"LCIA!$AK9+LCIA!$AL9","v":0},{"$f":"LCIA!$AK10+LCIA!$AL10","v":0},{"$f":"LCIA!$AK11+LCIA!$AL11","v":0},{"$f":"LCIA!$AK12+LCIA!$AL12","v":0}]
[null,"KVA (inkl. direkte Emissionen)",null,null,{"$error":"#DIV/0!"},null,null,{"$f":"LCIA!$E9+LCIA!$F9+LCIA!$G9+LCIA!$L9+LCIA!$M9+LCIA!$AM9+LCIA!$AN9+LCIA!$AO9+LCIA!$AP9+LCIA!$AQ9+LCIA!$AR9+LCIA!$AS9","v":0},{"$f":"LCIA!$E10+LCIA!$F10+LCIA!$G9+LCIA!$L10+LCIA!$M10+LCIA!$AM10+LCIA!$AN10+LCIA!$AO10+LCIA!$AP10+LCIA!$AQ10+LCIA!$AR10+LCIA!$AS10","v":0},{"$f":"LCIA!$E11+LCIA!$F11+LCIA!$G9+LCIA!$L11+LCIA!$M11+LCIA!$AM11+LCIA!$AN11+LCIA!$AO11+LCIA!$AP11+LCIA!$AQ11+LCIA!$AR11+LCIA!$AS11","v":0},{"$f":"LCIA!$E12+LCIA!$F12+LCIA!$G9+LCIA!$L12+LCIA!$M12+LCIA!$AM12+LCIA!$AN12+LCIA!$AO12+LCIA!$AP12+LCIA!$AQ12+LCIA!$AR12+LCIA!$AS12","v":0}]
[null,"Hilfsstoffe + importierte Energieträger",null,null,{"$error":"#DIV/0!"},null,null,{"$f":"SUM(LCIA!$Q9:$AH9)","v":0},{"$f":"SUM(LCIA!$Q10:$AH10)","v":0},{"$f":"SUM(LCIA!$Q11:$AH11)","v":0},{"$f":"SUM(LCIA!$Q12:$AH12)","v":0}]
[null,"Behandlung Flugasche (inkl. Deponie)",null,null,{"$error":"#DIV/0!"},null,null,{"$f":"LCIA!$C9+LCIA!$D9+LCIA!H9+LCIA!I9+LCIA!$N9+LCIA!$O9+LCIA!$P9+LCIA!$AI9","v":0},{"$f":"LCIA!$C10+LCIA!$D10+LCIA!H10+LCIA!I10+LCIA!$N10+LCIA!$O10+LCIA!$P10+LCIA!$AI10","v":0},{"$f":"LCIA!$C11+LCIA!$D11+LCIA!H11+LCIA!I11+LCIA!$N11+LCIA!$O11+LCIA!$P11+LCIA!$AI11","v":0},{"$f":"LCIA!$C12+LCIA!$D12+LCIA!H12+LCIA!I12+LCIA!$N12+LCIA!$O12+LCIA!$P12+LCIA!$AI12","v":0}]
[null,"Deponierung Bodenasche",null,null,{"$error":"#DIV/0!"},null,null,{"$f":"LCIA!$J9+LCIA!$K9","v":0},{"$f":"LCIA!$J10+LCIA!$K10","v":0},{"$f":"LCIA!$J11+LCIA!$K11","v":0},{"$f":"LCIA!$J12+LCIA!$K12","v":0}]
[null,"Deponierung Gewebefilterrückstände",null,null,{"$error":"#DIV/0!"},null,null,{"$f":"LCIA!AJ9","v":0},{"$f":"LCIA!AJ10","v":0},{"$f":"LCIA!AJ11","v":0},{"$f":"LCIA!AJ12","v":0}]
[null,"Total",null,null,{"$error":"#DIV/0!"},null,null,{"$f":"SUM(H5:H8)","v":0},{"$f":"SUM(I5:I8)","v":0},{"$f":"SUM(J5:J8)","v":0},{"$f":"SUM(K5:K8)","v":0}]
[]
[null,"Prüfwert","Total","EI'99-aggregated, Hierarchist","Anteil",null,null,"EI'99-aggregated, Hierarchist","Klimawandel","KEA, ne","ökologische Knappheit"]
[null,null,"a","Pkt",null,null,null,"Pkt","kg CO2-eq","MJ-eq","UBP 13 Pkte"]
[1,"Strom",{"$f":"INDEX(Prüfwert!$1:$1048576,7,MATCH(A14,Prüfwert!$1:$1,0))","v":0},{"$f":"INDEX(Prüfwert!$1:$1048576,8,MATCH(A14,Prüfwert!$1:$1,0))","v":0},{"$f":"D14/D$25","v":{"$error":"#DIV/0!"}},null,"Strom, kWh",{"$f":"IF($C14>0,$E14*H$10/$C14,0)","v":0},{"$f":"IF($C14>0,$E14*I$10/$C14,0)","v":0},0,0]
[2,"Wärme",{"$f":"INDEX(Prüfwert!$1:$1048576,7,MATCH(A15,Prüfwert!$1:$1,0))","v":0},{"$f":"INDEX(Prüfwert!$1:$1048576,8,MATCH(A15,Prüfwert!$1:$1,0))","v":0},{"$f":"D15/D$25","v":{"$error":"#DIV/0!"}},null,"Wärme, kWh",0,0,0,0]
[3,"Entsorgungsfunktion",{"$f":"INDEX(Prüfwert!$1:$1048576,7,MATCH(A16,Prüfwert!$1:$1,0))","v":0},{"$f":"INDEX(Prüfwert!$1:$1048576,8,MATCH(A16,Prüfwert!$1:$1,0))","v":0},{"$f":"D16/D$25","v":{"$error":"#DIV/0!"}},null,"Entsorgung, kg",0,0,0,0]
[4,"Sekundäraluminium, kg",{"$f":"INDEX(Prüfwert!$1:$1048576,7,MATCH(A17,Prüfwert!$1:$1,0))","v":0},{"$f":"INDEX(Prüfwert!$1:$1048576,8,MATCH(A17,Prüfwert!$1:$1,0))","v":0},{"$error":"#DIV/0!"},null,"Sekundäraluminium, kg",0,0,0,0]
[5,"Sekundärkupfer, kg",{"$f":"INDEX(Prüfwert!$1:$1048576,7,MATCH(A18,Prüfwert!$1:$1,0))","v":0},{"$f":"INDEX(Prüfwert!$1:$1048576,8,MATCH(A18,Prüfwert!$1:$1,0))","v":0},{"$error":"#DIV/0!"},null,"Sekundärkupfer, kg",0,0,0,0]
[6,"Sekundär-Gold, kg",{"$f":"INDEX(Prüfwert!$1:$1048576,7,MATCH(A19,Prüfwert!$1:$1,0))","v":0},{"$f":"INDEX(Prüfwert!$1:$1048576,8,MATCH(A19,Prüfwert!$1:$1,0))","v":0},{"$error":"#DIV/0!"},null,"Sekundär-Gold, kg",0,0,0,0]
[7,"Sekundär-Edelstahl, kg",{"$f":"INDEX(Prüfwert!$1:$1048576,7,MATCH(A20,Prüfwert!$1:$1,0))","v":0},{"$f":"INDEX(Prüfwert!$1:$1048576,8,MATCH(A20,Prüfwert!$1:$1,0))","v":0},{"$f":"D20/D$25","v":{"$error":"#DIV/0!"}},null,"Sekundär-Edelstahl, kg",0,0,0,0]
[8,"Eisenschrott, kg",{"$f":"INDEX(Prüfwert!$1:$1048576,7,MATCH(A21,Prüfwert!$1:$1,0))","v":0},{"$f":"INDEX(Prüfwert!$1:$1048576,8,MATCH(A21,Prüfwert!$1:$1,0))","v":0},{"$error":"#DIV/0!"},null,"Eisenschrott, kg",0,0,0,0]
[9,"Sekundärzink, kg",{"$f":"INDEX(Prüfwert!$1:$1048576,7,MATCH(A22,Prüfwert!$1:$1,0))","v":0},{"$f":"INDEX(Prüfwert!$1:$1048576,8,MATCH(A22,Prüfwert!$1:$1,0))","v":0},{"$error":"#DIV/0!"},null,"Sekundärzink, kg",0,0,0,0]
[10,"Sekundär-Zinkkonzentrat, kg",{"$f":"INDEX(Prüfwert!$1:$1048576,7,MATCH(A23,Prüfwert!$1:$1,0))","v":0},{"$f":"INDEX(Prüfwert!$1:$1048576,8,MATCH(A23,Prüfwert!$1:$1,0))","v":0},{"$error":"#DIV/0!"},null,"Sekundär-Zinkkonzentrat, kg",0,0,0,0]
[11,"Sekundär-Bleikonzentrat, kg",{"$f":"INDEX(Prüfwert!$1:$1048576,7,MATCH(A24,Prüfwert!$1:$1,0))","v":0},{"$f":"INDEX(Prüfwert!$1:$1048576,8,MATCH(A24,Prüfwert!$1:$1,0))","v":0},{"$f":"D24/D$25","v":{"$error":"#DIV/0!"}},null,"Sekundär-Bleikonzentrat, kg",0,0,0,0]
[null,"Total",null,{"$f":"SUM(D14:D24)","v":0},{"$f":"SUM(E14:E24)","v":{"$error":"#DIV/0!"}}]

{"sheet":"LCIA","index":4,"n_rows":250,"n_cols":48,"rows_kept":250,"cut":false,"hidden":true,"merged":[]}
["Zeile 1",null,39,37,12,12,12,null,null,12,12,12,12,37,37,38,13,17,47,48,16,18,21,43,15,23,14,19,20,45,46,22,null,null,40,12,52,53,12,27,28,29,51,26,26]
["Zeile 2",null,null,38,{"$nulls":31},44]
[null,null,"disposal, municipal solid waste, fly ash, to residual material landfill/CH U","disposal, municipal solid waste, fly ash, to slag compartment/CH U","disposal, municipal solid waste, SCR high dust/CH U","disposal, municipal solid waste, SCR low dust/CH U","disposal, municipal solid waste, SNCR/CH U","disposal, municipal solid waste, scrubber sludge, to residual material landfill/CH U","disposal, municipal solid waste, scrubber sludge, to slag compartment/CH U","disposal, municipal solid waste, slag, to slag compartment/CH U","electricity, low voltage, at grid/kWh/CH U for slag descrapping","disposal, municipal solid waste, to municipal incineration with dry RGR/CH U","disposal, municipal solid waste, to municipal incineration with wet RGR/CH U","treatment, fly ash, external acid scrubbing FLUWA/kg/CH U","processing, hydroxid slugde from acid fly ash scrubbing  (waelz process)/kg/DE U","treatment, fly ash, external acid scrubbing FLUREC/kg/CH U","Sodium hydroxide, 50% in H2O, production mix, at plant/RER U","Quicklime, milled, packed, at plant/CH U","Lime, hydrated, packed, at plant/CH U","Sodium chloride, brine solution, at plant/RER U","Hydrochloric acid, 30% in H2O, at plant/RER U","Iron (III) chloride, 40% in H2O, at plant/CH U","Chemicals organic, at plant/GLO U","Chemicals inorganic, at plant/GLO U","Ammonia, liquid, at regional storehouse/CH U","electricity, low voltage, at grid/kWh/CH U","Soda, powder, at plant/RER U","Lignite briquettes, at plant/DE U","Propane/ butane, at refinery/CH U","natural gas, low pressure, at consumer/MJ/CH U","Light fuel oil, at regional storage/CH U","tap water, at user/kg/CH U","Transport, freight, rail/RER U","Transport, lorry 20-28t, fleet average/CH U","disposal, municipal solid waste, fly ash, to underground deposit/kg/CH U","disposal, municipal solid waste,GFresidue, to underground deposit/CH U","Transport, freight, rail/RER U","Transport, lorry 20-28t, fleet average/CH U","Carbon dioxide, fossil, in air","Sulfur dioxide, in air","Nitrogen oxides, in air","Ammonia, in air","Zinc, in air","Particulates, < 2.5 um","Particulates, > 2.5 um, and < 10um"]
["Eingabe 1",null,{"$f":"INDEX(Eingabe!$1:$1048576,MATCH(C$1,Eingabe!$A:$A,0),3)","v":0},{"$f":"INDEX(Eingabe!$1:$1048576,MATCH(D$1,Eingabe!$A:$A,0),3)","v":0},{"$f":"INDEX(Eingabe!$1:$1048576,MATCH(E$1,Eingabe!$A:$A,0),3)","v":0},{"$f":"INDEX(Eingabe!$1:$1048576,MATCH(F$1,Eingabe!$A:$A,0),3)","v":0},{"$f":"INDEX(Eingabe!$1:$1048576,MATCH(G$1,Eingabe!$A:$A,0),3)","v":0},null,null,{"$f":"INDEX(Eingabe!$1:$1048576,MATCH(J$1,Eingabe!$A:$A,0),3)","v":0},{"$f":"INDEX(Eingabe!$1:$1048576,MATCH(K$1,Eingabe!$A:$A,0),3)","v":0},{"$f":"INDEX(Eingabe!$1:$1048576,MATCH(L$1,Eingabe!$A:$A,0),3)","v":0},{"$f":"INDEX(Eingabe!$1:$1048576,MATCH(M$1,Eingabe!$A:$A,0),3)","v":0},{"$f":"INDEX(Eingabe!$1:$1048576,MATCH(N$1,Eingabe!$A:$A,0),3)","v":0},{"$f":"INDEX(Eingabe!$1:$1048576,MATCH(O$1,Eingabe!$A:$A,0),3)","v":0},{"$f":"INDEX(Eingabe!$1:$1048576,MATCH(P$1,Eingabe!$A:$A,0),3)","v":0},{"$f":"INDEX(Eingabe!$1:$1048576,MATCH(Q$1,Eingabe!$A:$A,0),3)","v":0},{"$f":"INDEX(Eingabe!$1:$1048576,MATCH(R$1,Eingabe!$A:$A,0),3)","v":0},{"$f":"INDEX(Eingabe!$1:$1048576,MATCH(S$1,Eingabe!$A:$A,0),3)","v":0},{"$f":"INDEX(Eingabe!$1:$1048576,MATCH(T$1,Eingabe!$A:$A,0),3)","v":0},{"$f":"INDEX(Eingabe!$1:$1048576,MATCH(U$1,Eingabe!$A:$A,0),3)","v":0},{"$f":"INDEX(Eingabe!$1:$1048576,MATCH(V$1,Eingabe!$A:$A,0),3)","v":0},{"$f":"INDEX(Eingabe!$1:$1048576,MATCH(W$1,Eingabe!$A:$A,0),3)","v":0},{"$f":"INDEX(Eingabe!$1:$1048576,MATCH(X$1,Eingabe!$A:$A,0),3)","v":0},{"$f":"INDEX(Eingabe!$1:$1048576,MATCH(Y$1,Eingabe!$A:$A,0),3)","v":0},{"$f":"INDEX(Eingabe!$1:$1048576,MATCH(Z$1,Eingabe!$A:$A,0),3)","v":0},{"$f":"INDEX(Eingabe!$1:$1048576,MATCH(AA$1,Eingabe!$A:$A,0),3)","v":0},{"$f":"INDEX(Eingabe!$1:$1048576,MATCH(AB$1,Eingabe!$A:$A,0),3)","v":0},{"$f":"INDEX(Eingabe!$1:$1048576,MATCH(AC$1,Eingabe!$A:$A,0),3)","v":0},{"$f":"INDEX(Eingabe!$1:$1048576,MATCH(AD$1,Eingabe!$A:$A,0),3)","v":0},{"$f":"INDEX(Eingabe!$1:$1048576,MATCH(AE$1,Eingabe!$A:$A,0),3)","v":0},{"$f":"INDEX(Eingabe!$1:$1048576,MATCH(AF$1,Eingabe!$A:$A,0),3)","v":0},null,null,{"$f":"INDEX(Eingabe!$1:$1048576,MATCH(AI$1,Eingabe!$A:$A,0),3)","v":0},{"$f":"INDEX(Eingabe!$1:$1048576,MATCH(AJ$1,Eingabe!$A:$A,0),3)","v":0},{"$f":"INDEX(Eingabe!$1:$1048576,MATCH(AK$1,Eingabe!$A:$A,0),3)","v":0},{"$f":"INDEX(Eingabe!$1:$1048576,MATCH(AL$1,Eingabe!$A:$A,0),3)","v":0},{"$f":"INDEX(Eingabe!$1:$1048576,MATCH(AM$1,Eingabe!$A:$A,0),3)","v":0},{"$f":"INDEX(Eingabe!$1:$1048576,MATCH(AN$1,Eingabe!$A:$A,0),3)","v":0},{"$f":"INDEX(Eingabe!$1:$1048576,MATCH(AO$1,Eingabe!$A:$A,0),3)","v":0},{"$f":"INDEX(Eingabe!$1:$1048576,MATCH(AP$1,Eingabe!$A:$A,0),3)","v":0},{"$f":"INDEX(Eingabe!$1:$1048576,MATCH(AQ$1,Eingabe!$A:$A,0),3)","v":0},{"$f":"INDEX(Eingabe!$1:$1048576,MATCH(AR$1,Eingabe!$A:$A,0),3)","v":0},{"$f":"INDEX(Eingabe!$1:$1048576,MATCH(AS$1,Eingabe!$A:$A,0),3)","v":0}]
["Eingabe 2",null,{"$f":"INDEX(Eingabe!$1:$1048576,MATCH(C$1,Eingabe!$A:$A,0),4)","v":0},{"$f":"INDEX(Eingabe!$1:$1048576,MATCH(D$2,Eingabe!$A:$A,0),3)","v":0},{"$f":"INDEX(Eingabe!$1:$1048576,MATCH(E$1,Eingabe!$A:$A,0),4)","v":0},{"$f":"INDEX(Eingabe!$1:$1048576,MATCH(F$1,Eingabe!$A:$A,0),4)","v":0},{"$f":"INDEX(Eingabe!$1:$1048576,MATCH(G$1,Eingabe!$A:$A,0),4)","v":0},null,null,{"$f":"INDEX(Eingabe!$1:$1048576,MATCH(J$1,Eingabe!$A:$A,0),4)","v":0},null,{"$f":"INDEX(Eingabe!$1:$1048576,MATCH(L$1,Eingabe!$A:$A,0),4)","v":0},{"$f":"INDEX(Eingabe!$1:$1048576,MATCH(M$1,Eingabe!$A:$A,0),4)","v":0},{"$f":"INDEX(Eingabe!$1:$1048576,MATCH(N$1,Eingabe!$A:$A,0),4)","v":0},{"$f":"INDEX(Eingabe!$1:$1048576,MATCH(O$1,Eingabe!$A:$A,0),4)","v":0},{"$f":"INDEX(Eingabe!$1:$1048576,MATCH(P$1,Eingabe!$A:$A,0),4)","v":0},{"$f":"INDEX(Eingabe!$1:$1048576,MATCH(Q$1,Eingabe!$A:$A,0),4)","v":0},{"$f":"INDEX(Eingabe!$1:$1048576,MATCH(R$1,Eingabe!$A:$A,0),4)","v":0},{"$f":"INDEX(Eingabe!$1:$1048576,MATCH(S$1,Eingabe!$A:$A,0),4)","v":0},{"$f":"INDEX(Eingabe!$1:$1048576,MATCH(T$1,Eingabe!$A:$A,0),4)","v":0},{"$f":"INDEX(Eingabe!$1:$1048576,MATCH(U$1,Eingabe!$A:$A,0),4)","v":0},{"$f":"INDEX(Eingabe!$1:$1048576,MATCH(V$1,Eingabe!$A:$A,0),4)","v":0},{"$f":"INDEX(Eingabe!$1:$1048576,MATCH(W$1,Eingabe!$A:$A,0),4)","v":0},{"$f":"INDEX(Eingabe!$1:$1048576,MATCH(X$1,Eingabe!$A:$A,0),4)","v":0},{"$f":"INDEX(Eingabe!$1:$1048576,MATCH(Y$1,Eingabe!$A:$A,0),4)","v":0},{"$f":"INDEX(Eingabe!$1:$1048576,MATCH(Z$1,Eingabe!$A:$A,0),4)","v":0},null,{"$f":"INDEX(Eingabe!$1:$1048576,MATCH(AB$1,Eingabe!$A:$A,0),4)","v":0},{"$f":"INDEX(Eingabe!$1:$1048576,MATCH(AC$1,Eingabe!$A:$A,0),4)","v":0},null,null,{"$f":"INDEX(Eingabe!$1:$1048576,MATCH(AF$1,Eingabe!$A:$A,0),4)","v":0},null,null,null,{"$f":"INDEX(Eingabe!$1:$1048576,MATCH(AJ$2,Eingabe!$A:$A,0),3)","v":0},{"$f":"INDEX(Eingabe!$1:$1048576,MATCH(AK$1,Eingabe!$A:$A,0),4)","v":0},{"$f":"INDEX(Eingabe!$1:$1048576,MATCH(AL$1,Eingabe!$A:$A,0),4)","v":0},{"$f":"AU65/Ergebnis!$I$24","v":{"$error":"#DIV/0!"}},{"$f":"INDEX(Eingabe!$1:$1048576,MATCH(AN$1,Eingabe!$A:$A,0),4)","v":0},{"$f":"INDEX(Eingabe!$1:$1048576,MATCH(AO$1,Eingabe!$A:$A,0),4)","v":0},{"$f":"INDEX(Eingabe!$1:$1048576,MATCH(AP$1,Eingabe!$A:$A,0),4)","v":0}]
["Umrechnungsfaktor",null,{"$f":"IF(Eingabe!$E$47=TRUE, C4*Eingabe!C12*1000*Ergebnis!$I$24, C4*Eingabe!C12*1000)","v":0},{"$f":"IF(Eingabe!$E$47=TRUE,(D4*Eingabe!$C$12+D5*Eingabe!$C$12)*1000*0.7*Ergebnis!$I$24,(D4*Eingabe!$C$12+D5*Eingabe!$C$12)*1000*0.7)","v":0},{"$f":"IF(Eingabe!$E$47=TRUE,IF(Eingabe!$E$9=E8,E4*Ergebnis!$I$24,0)*1000,IF(Eingabe!$E$9=E8,E4*1,0)*1000)","v":0},{"$f":"IF(Eingabe!$E$47=TRUE,IF(Eingabe!$E$9=F8,F4*Ergebnis!$I$24,0)*1000,IF(Eingabe!$E$9=F8,F4*1,0)*1000)","v":0},{"$f":"IF(Eingabe!$E$47=TRUE,IF(Eingabe!$E$9=G8,G4*Ergebnis!$I$24,0)*1000,IF(Eingabe!$E$9=G8,G4*1,0)*1000)","v":0},{"$f":"IF(Eingabe!$E$47=TRUE,IF(Eingabe!$E$8=H8,(Eingabe!C62+Eingabe!C63)*Eingabe!$C$12*Ergebnis!$I$24,0)*1000,IF(Eingabe!$E$8=H8,Eingabe!C62*Eingabe!$C$12+Eingabe!C63*Eingabe!$C$12,0)*1000)","v":0},{"$f":"IF(Eingabe!$E$47=TRUE,IF(Eingabe!$E$8=I8,(Eingabe!C60+Eingabe!C61)*Eingabe!$C$12*Ergebnis!$I$24,0)*1000,IF(Eingabe!$E$8=I8,Eingabe!C60*Eingabe!$C$12+Eingabe!C61*Eingabe!$C$12,0)*1000)","v":0},{"$f":"IF(Eingabe!$E$47=TRUE,J4*Ergebnis!$I$24*1000-SUM(Prüfwert!F7:J7),J4*1000-SUM(Prüfwert!F7:J7))","v":0},{"$f":"IF(Eingabe!$E$47=TRUE,6.5*K4*Ergebnis!$I$24*0.2,6.5*K4*0.2)","v":0},{"$f":"IF(Eingabe!$E$47=TRUE, IF(Eingabe!$E$8=L8,L4*Ergebnis!$I$24,0)*1000,IF(Eingabe!$E$8=L8,L4*1,0)*1000)","v":0},{"$f":"IF(Eingabe!$E$47=TRUE,IF(Eingabe!$E$8=M8,M4*Ergebnis!$I$24,0)*1000,IF(Eingabe!$E$8=M8,M4*1,0)*1000)","v":0},{"$f":"IF(Eingabe!$E$47=TRUE,IF(Eingabe!$E$60=N8,N4*Eingabe!$C$12*Ergebnis!$I$24,0)*1000*0.02,IF(Eingabe!$E$60=N8,N4*Eingabe!$C$12,0)*1000*0.02)","v":0},{"$f":"IF(Eingabe!$E$47=TRUE,IF(Eingabe!$E$60=O8,O4*Eingabe!$C$12*Ergebnis!$I$24,0)*1000*0.02*0.3,IF(Eingabe!$E$60=O8,O4*Eingabe!$C$12,0)*1000*0.02*0.3)","v":0},{"$f":"IF(Eingabe!$E$47=TRUE,P4*Eingabe!$C$12*Ergebnis!$I$24*1000*0.02,P4*Eingabe!$C$12*1000*0.02)","v":0},{"$f":"IF(Eingabe!$E$47=TRUE, IF(Q4=0,0,Q5*Q4/0.5*Ergebnis!$I$24*1000),IF(Q4=0,0,Q5*Q4/0.5*1000))","v":0},{"$f":"IF(Eingabe!$E$47=TRUE,R4*1000*Ergebnis!$I$24,R4*1000)","v":0},{"$f":"IF(Eingabe!$E$47=TRUE,S4*1000*Ergebnis!$I$24,S4*1000)","v":0},{"$f":"IF(Eingabe!$E$47=TRUE,T4*1000*Ergebnis!$I$24,T4*1000)","v":0},{"$f":"IF(Eingabe!$E$47=TRUE,(U4*U5)*1000*Ergebnis!$I$24,(U4*U5)*1000)","v":0},{"$f":"IF(Eingabe!$E$47=TRUE,V4*V5*1000*Ergebnis!$I$24,V4*V5*1000)","v":0},{"$f":"IF(Eingabe!$E$47=TRUE,(W4*W5)*1000*Ergebnis!$I$24,(W4*W5)*1000)","v":0},{"$f":"IF(Eingabe!$E$47=TRUE,(X4*X5)*1000*Ergebnis!$I$24,(X4*X5)*1000)","v":0},{"$f":"IF(Eingabe!$E$47=TRUE,(Y4*Y5)*1000*Ergebnis!$I$24,(Y4*Y5)*1000)","v":0},{"$f":"IF(Eingabe!$E$47=TRUE,Z4*1000*Ergebnis!$I$24,Z4*1000)","v":0},{"$f":"IF(Eingabe!$E$47=TRUE,AA4*1000*Ergebnis!$I$24,AA4*1000)","v":0},{"$f":"IF(Eingabe!$E$47=TRUE,AB4*1000*Ergebnis!$I$24*19.5,AB4*1000*19.5)","v":0},{"$f":"IF(Eingabe!$E$47=TRUE,(AC4*Ergebnis!$I$24),(AC4))","v":0},{"$f":"IF(Eingabe!$E$47=TRUE,AD4*37.8*Ergebnis!$I$24,AD4*37.8)","v":0},{"$f":"IF(Eingabe!$E$47=TRUE,AE4*0.86*Ergebnis!$I$24,AE4*0.86)","v":0},{"$f":"IF(Eingabe!$E$47=TRUE,AF4*Ergebnis!$I$24,AF4)","v":0},{"$f":"($Q$6+$R$6+$S$6+$T$6+$U$6+$V$6+$W$6+$X$6+$Y$6+$AA$6+$AC$6)/1000*600","v":0},{"$f":"($Q$6+$R$6+$S$6+$T$6+$U$6+$V$6+$W$6+$X$6+$Y$6+$AA$6+$AC$6)/1000*100","v":0},{"$f":"IF(Eingabe!$E$47=TRUE,AI4*Eingabe!C12*1000*Ergebnis!$I$24,AI4*Eingabe!C12*1000)","v":0},{"$f":"IF(Eingabe!$E$47=TRUE,IF(AJ4=0,0,AJ5/(AJ4*Ergebnis!$I$24)/0.00542286213268479),IF(AJ4=0,0,AJ5/AJ4/0.00542286213268479))","v":0},{"$f":"IF(Eingabe!$E$47=TRUE, AK4*Ergebnis!$I$24*AK5,AK4*AK5)","v":0},{"$f":"IF(Eingabe!$E$47=TRUE, AL4*Ergebnis!$I$24*AL5,AL4*AL5)","v":0},{"$f":"IF(Eingabe!E47=TRUE,AV65/AU65*AM5*AM4*Ergebnis!$I$24*1000+AE6*42.6*0.074+AD6*0.056+AC6/0.952*24.48*0.0654,AM4*1000*AV65+AE6*42.6*0.074+AD6*0.056+AC6/0.952*24.48*0.0654)","v":0},{"$f":"IF(Eingabe!$E$47=TRUE,AN4*Ergebnis!$I$24,AN4)","v":0},{"$f":"IF(Eingabe!$E$47=TRUE,AO4*Ergebnis!$I$24,AO4)","v":0},{"$f":"IF(Eingabe!$E$47=TRUE,AP4*Ergebnis!$I$24,AP4)","v":0},{"$f":"IF(Eingabe!$E$47=TRUE,IF(AQ4>0,AQ4*Ergebnis!$I$24,5.3*10^-7*Eingabe!C12*Ergebnis!$I$24*1000),IF(AQ4>0,AQ4,5.3*10^-7*Eingabe!C12*1000))","v":0},{"$f":"IF(Eingabe!$E$47=TRUE,IF(AR4>0,AR4*0.995*Ergebnis!$I$24,0.00000597*Eingabe!C12*Ergebnis!$I$24*1000),IF(AR4>0,AR4*0.995,0.00000597*Eingabe!C12*1000))","v":0},{"$f":"IF(Eingabe!$E$47=TRUE,IF(AS4>0,AS4*0.005*Ergebnis!$I$24,0.00000003*Eingabe!C12*Ergebnis!$I$24*1000),IF(AS4>0,AS4*0.005,0.00000003*Eingabe!C12*1000))","v":0}]
["Rauchgasreinigung"]
["DeNOx Technologie",null,null,null,2,1,3,1,1,null,null,2,1,2,1]
["EI'99-aggregated, Hierarchist",{"$f":"SUM(C9:AS9)","v":0},{"$f":"C$63*C$6","v":0},{"$f":"D$63*D$6","v":0},0,0,0,0,0,0,0,0,0,{"$f":"N$63*N$6","v":0},0,0,0,0,0,0,0,0,0,0,0,0,0,0,0,0,0,0,0,0,0,0,0,0,{"$f":"0.0095844*AM6","v":0},{"$f":"2.5647307*AN6","v":0},{"$f":"4.447721*AO6","v":0},{"$f":"4.9680544*AP6","v":0},{"$f":"202.0688*AQ6","v":0},{"$f":"32.394359*AR6","v":0},{"$f":"17.115*AS6","v":0}]
["Klimawandel",{"$f":"SUM(C10:AS10)","v":0},{"$f":"C$116*C$6","v":0},0,0,0,0,0,0,0,0,0,0,0,0,0,0,0,0,0,0,0,0,0,0,0,0,0,0,0,0,0,0,0,0,0,0,0,{"$f":"1*AM6","v":0},0,0,0,0,0,0]
["KEA, ne",{"$f":"SUM(C11:AS11)","v":0},{"$f":"C$168*C$6","v":0},0,0,0,0,0,0,0,0,0,0,0,0,0,0,0,0,0,0,0,0,0,0,0,0,0,0,0,0,0,0,0,0,0,0,0,0,0,0,0,0,0,0]
["ökologische Knappheit",{"$f":"SUM(C12:AS12)","v":0},{"$f":"C$228*C$6","v":0},0,0,0,0,0,0,0,0,0,0,0,0,0,0,0,0,0,0,0,0,0,0,0,0,0,0,0,0,0,0,0,0,0,0,0,{"$f":"460*AM6","v":0},{"$f":"21000*AN6","v":0},{"$f":"39000*AO6","v":0},{"$f":"67000*AP6","v":0},{"$f":"5600000*AQ6","v":0},{"$f":"140000*AR6","v":0},{"$f":"140000*AS6","v":0}]
[]
[]
[]
["Calculation: ","Compare"]
["Results: ","Impact assessment"]
["Product 1: ","1 kg disposal, municipal solid waste, fly ash, to residual material landfill/kg/CH U (of project naturemade)"]
["Product 2: ","1 kg disposal, municipal solid waste, fly ash, to slag compartment/kg/CH U (of project naturemade)"]
["Product 3: ","1 kg disposal, municipal solid waste, SCR high dust/kg/CH U (of project naturemade)"]
["Product 4: ","1 kg disposal, municipal solid waste, SCR low dust/kg/CH U (of project naturemade)"]
["Product 5: ","1 kg disposal, municipal solid waste, SNCR/kg/CH U (of project naturemade)"]
["Product 6: ","1 kg disposal, municipal solid waste, scrubber sludge, to residual material landfill/kg/CH U (of project naturemade)"]
["Product 7: ","1 kg disposal, municipal solid waste, scrubber sludge, to slag compartment/kg/CH U (of project naturemade)"]
["Product 8: ","1 kg disposal, municipal solid waste, slag, to slag compartment/kg/CH U (of project naturemade)"]
["Product 9: ","1 kWh electricity, low voltage, at grid/kWh/CH U (of project Ecoinvent unit processes)"]
["Product 10: ","1 kg disposal, municipal solid waste, to municipal incineration with dry RGR/kg/CH U (of project naturemade)"]
["Product 11: ","1 kg disposal, municipal solid waste, to municipal incineration with wet RGR/kg/CH U (of project naturemade)"]
["Product 12: ","1 kg treatment, fly ash, external FLUWA (without landfill)/CH U (of project naturemade)"]
["Product 13: ","1 kg processing, hydroxid slugde from acid fly ash scrubbing  (waelz process)/kg/DE U (of project naturemade)"]
["Product 14: ","1 kg treatment, fly ash, external FLUREC (without landfill)/CH U (of project naturemade)"]
["Product 15: ","1 kg Sodium hydroxide, 50% in H2O, production mix, at plant/RER U (of project Ecoinvent unit processes)"]
["Product 16: ","1 kg Quicklime, milled, packed, at plant/CH U (of project Ecoinvent unit processes)"]
["Product 17: ","1 kg Lime, hydrated, packed, at plant/CH U (of project Ecoinvent unit processes)"]
["Product 18: ","1 kg Sodium chloride, brine solution, at plant/RER U (of project Ecoinvent unit processes)"]
["Product 19: ","1 kg Hydrochloric acid, 30% in H2O, at plant/RER U (of project Ecoinvent unit processes)"]
["Product 20: ","1 kg Iron (III) chloride, 40% in H2O, at plant/CH U (of project Ecoinvent unit processes)"]
["Product 21: ","1 kg Chemicals organic, at plant/GLO U (of project Ecoinvent unit processes)"]
["Product 22: ","1 kg Chemicals inorganic, at plant/GLO U (of project Ecoinvent unit processes)"]
["Product 23: ","1 kg Ammonia, liquid, at regional storehouse/CH U (of project Ecoinvent unit processes)"]
["Product 24: ","1 kWh electricity, low voltage, at grid/kWh/CH U (of project Ecoinvent unit processes)"]
["Product 25: ","1 kg Soda, powder, at plant/RER U (of project Ecoinvent unit processes)",{"$nulls":36},"Analysieren"]
["Product 26: ","1 MJ Lignite briquettes, at plant/DE U (of project Ecoinvent unit processes)",{"$nulls":36},"Bilanz"]
["Product 27: ","1 kg propane/ butane, at refinery/kg/CH U (of project Ecoinvent unit processes)",{"$nulls":36},"1 kg Polutant emissions (of project 529 naturemade)"]
["Product 28: ","1 MJ natural gas, low pressure, at consumer/MJ/CH U (of project Ecoinvent unit processes)"]
["Product 29: ","1 kg light fuel oil, at regional storage/kg/CH U (of project Ecoinvent unit processes)"]
["Product 30: ","1 kg tap water, at user/kg/CH U (of project Ecoinvent unit processes)",{"$nulls":36},"Eco-indicator 99 (H) V2.09 / Europe EI 99 H/A"]
["Product 31: ","1 tkm Transport, freight, rail/RER U (of project Ecoinvent unit processes)",{"$nulls":36},"Einzelergebnis"]
["Product 32: ","1 tkm Transport, lorry 20-28t, fleet average/CH U (of project Ecoinvent unit processes)",{"$nulls":36},"Alle Kompartimente"]
["Product 33: ","1 kg disposal, municipal solid waste, fly ash, to underground deposit/kg/CH U (of project naturemade)"]
["Product 34: ","1 kg disposal, municipal solid waste,GFresidue, to underground deposit/kg/CH U (of project naturemade)"]
["Method: ","Eco-indicator 99 (H) V2.10 / Europe EI 99 H/A",{"$nulls":36},"Nein"]
["Indicator: ","Single score",{"$nulls":36},0]
["Skip categories: ","Never",{"$nulls":36},"Ja"]
["Default units: ","Yes",{"$nulls":36},"Nein"]
["Exclude infrastructure processes: ","No",{"$nulls":36},"Ja"]
["Exclude long-term emissions: ","Yes",{"$nulls":36},"Stoff"]
["Per impact category: ","No",{"$nulls":36},"Aufsteigend"]
["Sorted on item: ","Damage category"]
["Sort order: ","Ascending",{"$nulls":36},"Stoff","Kompartiment","Einheit","Summe","Polutant emissions"]
[]
["Damage category","Unit","disposal, municipal solid waste, fly ash, to residual material landfill/kg/CH U","disposal, municipal solid waste, fly ash, to slag compartment/kg/CH U","disposal, municipal solid waste, SCR high dust/kg/CH U","disposal, municipal solid waste, SCR low dust/kg/CH U","disposal, municipal solid waste, SNCR/kg/CH U","disposal, municipal solid waste, scrubber sludge, to residual material landfill/kg/CH U","disposal, municipal solid waste, scrubber sludge, to slag compartment/kg/CH U","disposal, municipal solid waste, slag, to slag compartment/kg/CH U","electricity, low voltage, at grid/kWh/CH U","disposal, municipal solid waste, to municipal incineration with dry RGR/kg/CH U","disposal, municipal solid waste, to municipal incineration with wet RGR/kg/CH U","treatment, fly ash, external FLUWA (without landfill)/CH U","processing, hydroxid slugde from acid fly ash scrubbing  (waelz process)/kg/DE U","treatment, fly ash, external FLUREC (without landfill)/CH U","Sodium hydroxide, 50% in H2O, production mix, at plant/RER U","Quicklime, milled, packed, at plant/CH U","Lime, hydrated, packed, at plant/CH U","Sodium chloride, brine solution, at plant/RER U","Hydrochloric acid, 30% in H2O, at plant/RER U","Iron (III) chloride, 40% in H2O, at plant/CH U","Chemicals organic, at plant/GLO U","Chemicals inorganic, at plant/GLO U","Ammonia, liquid, at regional storehouse/CH U","electricity, low voltage, at grid/kWh/CH U","Soda, powder, at plant/RER U","Lignite briquettes, at plant/DE U","propane/ butane, at refinery/kg/CH U","natural gas, low pressure, at consumer/MJ/CH U","light fuel oil, at regional storage/kg/CH U","tap water, at user/kg/CH U","Transport, freight, rail/RER U","Transport, lorry 20-28t, fleet average/CH U","disposal, municipal solid waste, fly ash, to underground deposit/kg/CH U","disposal, municipal solid waste,GFresidue, to underground deposit/kg/CH U","Transport, freight, rail/RER U","Transport, lorry 20-28t, fleet average/CH U","Ammonia","Luft","Pt",4.9680543999999998,4.9680543999999998,null,null,null,"Gemäss Doka besteht durchschnittlicher Siedlungsabfall zu 62.25 % aus biogenem und zu 37.75% aus fossilem Abfall","Doka G. (2013) Updates to Life Cycle Inventories of Waste Treatment Services - part II: waste incineration. Doka Life Cycle Assessments, Zürich, Switzerland. "]
["Total","Pt",2.5466900999999999E-3,6.1083132999999995E-5,9.4170055999999994E-5,1.4588241000000001E-3,9.7716186999999996E-5,2.4205577000000001E-5,1.9622597000000002E-6,4.6441838000000002E-4,7.6576856999999998E-3,3.8098926000000003E-4,3.8639924999999997E-4,1.5408600999999999E-2,1.0373426E-2,2.8757608E-2,6.3056836000000005E-2,3.6215281000000002E-2,2.8073665000000001E-2,1.1069140999999999E-2,6.0954217999999998E-2,5.7679332999999999E-2,0.26365620000000001,0.16088353999999999,0.2160649,7.6576856999999998E-3,3.1986245000000003E-2,9.5667338999999997E-4,0.22306345999999999,4.4150335999999998E-3,0.23310771999999999,1.1465065000000001E-5,3.4226395000000001E-3,2.3795869000000001E-2,2.5466900999999999E-3,1.2800739000000001E-4,3.3914120999999999E-3,2.3483896000000001E-2,"Carbon dioxide, fossil","Luft","Pt",9.5843999999999999E-3,9.5843999999999999E-3]
["Human Health","Pt",2.4178480999999998E-3,3.4538787E-5,8.1532122000000005E-5,3.3464283E-4,9.7424436999999996E-5,1.8610991000000001E-5,8.3402349999999999E-7,2.0392832E-4,4.2728901999999997E-3,2.2837656000000001E-4,2.3224665E-4,7.3061604999999996E-3,7.5732059999999999E-3,1.2622604000000001E-2,3.5771177000000001E-2,1.7411286000000002E-2,1.3458998999999999E-2,5.5440065000000004E-3,3.1990691000000002E-2,3.2205464000000003E-2,5.1503723000000001E-2,9.3782109000000002E-2,6.5589119000000001E-2,4.2728901999999997E-3,2.3674226999999999E-2,8.8060552E-4,2.7826684000000001E-2,2.7498700999999999E-4,3.4721835999999999E-2,6.7364444999999996E-6,2.0278904000000002E-3,1.2032482000000001E-2,2.4178480999999998E-3,9.6214487000000003E-5,2.0141991E-3,1.1813995000000001E-2,"Nitrogen oxides","Luft","Pt",4.4477209999999996,4.4477209999999996,null,null,null,"Fossiler Abfallanteil","CO2 fossil [kg / kg Abfall]"]
["Ecosystem Quality","Pt",2.0944878E-5,3.0659984000000001E-6,1.0871435999999999E-6,1.4655992E-5,9.6787119E-8,7.6810853000000003E-7,2.4083605999999998E-7,2.8420613999999999E-5,4.9186958999999995E-4,5.3435813000000003E-5,5.4289687000000001E-5,6.8557521000000004E-4,5.1896498E-4,4.5206478000000003E-3,3.3380136000000001E-3,1.0247437000000001E-3,8.9425108999999995E-4,1.2950849E-3,3.7799701000000002E-3,5.1234656E-3,4.7184599999999998E-3,8.1295293000000005E-3,8.7868318000000004E-3,4.9186958999999995E-4,2.7757061000000002E-3,2.7252162999999998E-5,3.4325709000000001E-3,4.1807921999999997E-5,4.4859749000000001E-3,1.3925274000000001E-6,2.2134018999999999E-4,1.2369502E-3,2.0944878E-5,4.3485387000000002E-6,2.135207E-4,1.1688219000000001E-3,"Particulates, < 2.5 um","Luft","Pt",32.394359000000001,32.394359000000001,null,null,null,37.75,0.430498150583838]
["Resources","Pt",1.0789709999999999E-4,2.3478347E-5,1.1550790000000001E-5,1.1095253E-3,1.9496350999999999E-7,4.8264781E-6,8.8740014999999998E-7,2.3206944999999999E-4,2.8929259000000001E-3,9.9176882999999996E-5,9.9862905999999999E-5,7.4168652E-3,2.2812546000000001E-3,1.1614355999999999E-2,2.3947645E-2,1.7779251999999999E-2,1.3720415E-2,4.2300502E-3,2.5183556999999999E-2,2.0350403E-2,0.20743401,5.8971904999999998E-2,0.14168895000000001,2.8929259000000001E-3,5.5363124E-3,4.8815703999999998E-5,0.19180420000000001,4.0982387000000004E-3,0.19389991000000001,3.3360933999999999E-6,1.1734088E-3,1.0526437E-2,1.0789709999999999E-4,2.7444361000000001E-5,1.1636923999999999E-3,1.0501079E-2,"Particulates, > 2.5 um, and < 10um","Luft","Pt",17.114999999999998,17.114999999999998,null,null,null,80,0.91230658899999995]
[{"$nulls":46},100,1.1403832367107176]
[]
[]
[]
["Calculation: ","Compare"]
["Results: ","Impact assessment"]
["Product 1: ","1 kg disposal, municipal solid waste, fly ash, to residual material landfill/kg/CH U (of project naturemade)"]
["Product 2: ","1 kg disposal, municipal solid waste, fly ash, to slag compartment/kg/CH U (of project naturemade)"]
["Product 3: ","1 kg disposal, municipal solid waste, SCR high dust/kg/CH U (of project naturemade)"]
["Product 4: ","1 kg disposal, municipal solid waste, SCR low dust/kg/CH U (of project naturemade)"]
["Product 5: ","1 kg disposal, municipal solid waste, SNCR/kg/CH U (of project naturemade)"]
["Product 6: ","1 kg disposal, municipal solid waste, scrubber sludge, to residual material landfill/kg/CH U (of project naturemade)"]
["Product 7: ","1 kg disposal, municipal solid waste, scrubber sludge, to slag compartment/kg/CH U (of project naturemade)"]
["Product 8: ","1 kg disposal, municipal solid waste, slag, to slag compartment/kg/CH U (of project naturemade)"]
["Product 9: ","1 kWh electricity, low voltage, at grid/kWh/CH U (of project Ecoinvent unit processes)"]
["Product 10: ","1 kg disposal, municipal solid waste, to municipal incineration with dry RGR/kg/CH U (of project naturemade)"]
["Product 11: ","1 kg disposal, municipal solid waste, to municipal incineration with wet RGR/kg/CH U (of project naturemade)"]
["Product 12: ","1 kg treatment, fly ash, external FLUWA (without landfill)/CH U (of project naturemade)"]
["Product 13: ","1 kg processing, hydroxid slugde from acid fly ash scrubbing  (waelz process)/kg/DE U (of project naturemade)"]
["Product 14: ","1 kg treatment, fly ash, external FLUREC (without landfill)/CH U (of project naturemade)"]
["Product 15: ","1 kg Sodium hydroxide, 50% in H2O, production mix, at plant/RER U (of project Ecoinvent unit processes)"]
["Product 16: ","1 kg Quicklime, milled, packed, at plant/CH U (of project Ecoinvent unit processes)"]
["Product 17: ","1 kg Lime, hydrated, packed, at plant/CH U (of project Ecoinvent unit processes)"]
["Product 18: ","1 kg Sodium chloride, brine solution, at plant/RER U (of project Ecoinvent unit processes)"]
["Product 19: ","1 kg Hydrochloric acid, 30% in H2O, at plant/RER U (of project Ecoinvent unit processes)"]
["Product 20: ","1 kg Iron (III) chloride, 40% in H2O, at plant/CH U (of project Ecoinvent unit processes)"]
["Product 21: ","1 kg Chemicals organic, at plant/GLO U (of project Ecoinvent unit processes)"]
["Product 22: ","1 kg Chemicals inorganic, at plant/GLO U (of project Ecoinvent unit processes)"]
["Product 23: ","1 kg Ammonia, liquid, at regional storehouse/CH U (of project Ecoinvent unit processes)"]
["Product 24: ","1 kWh electricity, low voltage, at grid/kWh/CH U (of project Ecoinvent unit processes)"]
["Product 25: ","1 kg Soda, powder, at plant/RER U (of project Ecoinvent unit processes)"]
["Product 26: ","1 MJ Lignite briquettes, at plant/DE U (of project Ecoinvent unit processes)"]
["Product 27: ","1 kg propane/ butane, at refinery/kg/CH U (of project Ecoinvent unit processes)"]
["Product 28: ","1 MJ natural gas, low pressure, at consumer/MJ/CH U (of project Ecoinvent unit processes)"]
["Product 29: ","1 kg light fuel oil, at regional storage/kg/CH U (of project Ecoinvent unit processes)"]
["Product 30: ","1 kg tap water, at user/kg/CH U (of project Ecoinvent unit processes)"]
["Product 31: ","1 tkm Transport, freight, rail/RER U (of project Ecoinvent unit processes)"]
["Product 32: ","1 tkm Transport, lorry 20-28t, fleet average/CH U (of project Ecoinvent unit processes)"]
["Product 33: ","1 kg disposal, municipal solid waste, fly ash, to underground deposit/kg/CH U (of project naturemade)"]
["Product 34: ","1 kg disposal, municipal solid waste,GFresidue, to underground deposit/kg/CH U (of project naturemade)"]
["Method: ","IPCC 2013 GWP 100a V1.02 / IPCC GWP 100a"]
["Indicator: ","Characterisation"]
["Skip categories: ","Never"]
["Exclude infrastructure processes: ","No"]
["Exclude long-term emissions: ","Yes"]
["Sorted on item: ","Impact category"]
["Sort order: ","Ascending"]
[]
["Impact category","Unit","disposal, municipal solid waste, fly ash, to residual material landfill/kg/CH U","disposal, municipal solid waste, fly ash, to slag compartment/kg/CH U","disposal, municipal solid waste, SCR high dust/kg/CH U","disposal, municipal solid waste, SCR low dust/kg/CH U","disposal, municipal solid waste, SNCR/kg/CH U","disposal, municipal solid waste, scrubber sludge, to residual material landfill/kg/CH U","disposal, municipal solid waste, scrubber sludge, to slag compartment/kg/CH U","disposal, municipal solid waste, slag, to slag compartment/kg/CH U","electricity, low voltage, at grid/kWh/CH U","disposal, municipal solid waste, to municipal incineration with dry RGR/kg/CH U","disposal, municipal solid waste, to municipal incineration with wet RGR/kg/CH U","treatment, fly ash, external FLUWA (without landfill)/CH U","processing, hydroxid slugde from acid fly ash scrubbing  (waelz process)/kg/DE U","treatment, fly ash, external FLUREC (without landfill)/CH U","Sodium hydroxide, 50% in H2O, production mix, at plant/RER U","Quicklime, milled, packed, at plant/CH U","Lime, hydrated, packed, at plant/CH U","Sodium chloride, brine solution, at plant/RER U","Hydrochloric acid, 30% in H2O, at plant/RER U","Iron (III) chloride, 40% in H2O, at plant/CH U","Chemicals organic, at plant/GLO U","Chemicals inorganic, at plant/GLO U","Ammonia, liquid, at regional storehouse/CH U","electricity, low voltage, at grid/kWh/CH U","Soda, powder, at plant/RER U","Lignite briquettes, at plant/DE U","propane/ butane, at refinery/kg/CH U","natural gas, low pressure, at consumer/MJ/CH U","light fuel oil, at regional storage/kg/CH U","tap water, at user/kg/CH U","Transport, freight, rail/RER U","Transport, lorry 20-28t, fleet average/CH U","disposal, municipal solid waste, fly ash, to underground deposit/kg/CH U","disposal, municipal solid waste,GFresidue, to underground deposit/kg/CH U","Transport, freight, rail/RER U","Transport, lorry 20-28t, fleet average/CH U"]
["IPCC GWP 100a","kg CO2 eq",6.7280457E-3,3.1135800000000002E-4,3.756601E-3,2.2533358E-2,5.7711782000000001E-3,3.0088476999999997E-4,1.1774151000000001E-5,3.0772982000000001E-3,0.10179494,3.4345997999999998E-3,3.4647799000000002E-3,0.27397057000000002,0.38361422000000001,0.31588511000000002,1.0217103999999999,0.98266370000000003,0.75663533000000005,0.10785805,0.80566159999999998,0.74962375000000003,1.9424196,1.7847982,2.1342243000000001,0.10179494,0.43846236999999999,3.2957281999999997E-2,0.61562216999999997,1.2579408E-2,0.63665727000000005,1.4963205000000001E-4,3.8026181999999999E-2,0.19432759999999999,6.7280457E-3,1.7099661999999999E-3,3.7900486999999997E-2,0.19465774]
[]
[]
[]
[]
[]
["Calculation: ","Compare"]
["Results: ","Impact assessment"]
["Product 1: ","1 kg disposal, municipal solid waste, fly ash, to residual material landfill/kg/CH U (of project naturemade)"]
["Product 2: ","1 kg disposal, municipal solid waste, fly ash, to slag compartment/kg/CH U (of project naturemade)"]
["Product 3: ","1 kg disposal, municipal solid waste, SCR high dust/kg/CH U (of project naturemade)"]
["Product 4: ","1 kg disposal, municipal solid waste, SCR low dust/kg/CH U (of project naturemade)"]
["Product 5: ","1 kg disposal, municipal solid waste, SNCR/kg/CH U (of project naturemade)"]
["Product 6: ","1 kg disposal, municipal solid waste, scrubber sludge, to residual material landfill/kg/CH U (of project naturemade)"]
["Product 7: ","1 kg disposal, municipal solid waste, scrubber sludge, to slag compartment/kg/CH U (of project naturemade)"]
["Product 8: ","1 kg disposal, municipal solid waste, slag, to slag compartment/kg/CH U (of project naturemade)"]
["Product 9: ","1 kWh electricity, low voltage, at grid/kWh/CH U (of project Ecoinvent unit processes)"]
["Product 10: ","1 kg disposal, municipal solid waste, to municipal incineration with dry RGR/kg/CH U (of project naturemade)"]
["Product 11: ","1 kg disposal, municipal solid waste, to municipal incineration with wet RGR/kg/CH U (of project naturemade)"]
["Product 12: ","1 kg treatment, fly ash, external FLUWA (without landfill)/CH U (of project naturemade)"]
["Product 13: ","1 kg processing, hydroxid slugde from acid fly ash scrubbing  (waelz process)/kg/DE U (of project naturemade)"]
["Product 14: ","1 kg treatment, fly ash, external FLUREC (without landfill)/CH U (of project naturemade)"]
["Product 15: ","1 kg Sodium hydroxide, 50% in H2O, production mix, at plant/RER U (of project Ecoinvent unit processes)"]
["Product 16: ","1 kg Quicklime, milled, packed, at plant/CH U (of project Ecoinvent unit processes)"]
["Product 17: ","1 kg Lime, hydrated, packed, at plant/CH U (of project Ecoinvent unit processes)"]
["Product 18: ","1 kg Sodium chloride, brine solution, at plant/RER U (of project Ecoinvent unit processes)"]
["Product 19: ","1 kg Hydrochloric acid, 30% in H2O, at plant/RER U (of project Ecoinvent unit processes)"]
["Product 20: ","1 kg Iron (III) chloride, 40% in H2O, at plant/CH U (of project Ecoinvent unit processes)"]
["Product 21: ","1 kg Chemicals organic, at plant/GLO U (of project Ecoinvent unit processes)"]
["Product 22: ","1 kg Chemicals inorganic, at plant/GLO U (of project Ecoinvent unit processes)"]
["Product 23: ","1 kg Ammonia, liquid, at regional storehouse/CH U (of project Ecoinvent unit processes)"]
["Product 24: ","1 kWh electricity, low voltage, at grid/kWh/CH U (of project Ecoinvent unit processes)"]
["Product 25: ","1 kg Soda, powder, at plant/RER U (of project Ecoinvent unit processes)"]
["Product 26: ","1 MJ Lignite briquettes, at plant/DE U (of project Ecoinvent unit processes)"]
["Product 27: ","1 kg propane/ butane, at refinery/kg/CH U (of project Ecoinvent unit processes)"]
["Product 28: ","1 MJ natural gas, low pressure, at consumer/MJ/CH U (of project Ecoinvent unit processes)"]
["Product 29: ","1 kg light fuel oil, at regional storage/kg/CH U (of project Ecoinvent unit processes)"]
["Product 30: ","1 kg tap water, at user/kg/CH U (of project Ecoinvent unit processes)"]
["Product 31: ","1 tkm Transport, freight, rail/RER U (of project Ecoinvent unit processes)"]
["Product 32: ","1 tkm Transport, lorry 20-28t, fleet average/CH U (of project Ecoinvent unit processes)"]
["Product 33: ","1 kg disposal, municipal solid waste, fly ash, to underground deposit/kg/CH U (of project naturemade)"]
["Product 34: ","1 kg disposal, municipal solid waste,GFresidue, to underground deposit/kg/CH U (of project naturemade)"]
["Method: ","Cumulative Energy Demand, differenziert V1.04 / CED, non-renewable"]
["Indicator: ","Single score"]
["Skip categories: ","Never"]
["Default units: ","Yes"]
["Exclude infrastructure processes: ","No"]
["Exclude long-term emissions: ","Yes"]
["Sorted on item: ","Impact category"]
["Sort order: ","Ascending"]
[]
["Impact category","Unit","disposal, municipal solid waste, fly ash, to residual material landfill/kg/CH U","disposal, municipal solid waste, fly ash, to slag compartment/kg/CH U","disposal, municipal solid waste, SCR high dust/kg/CH U","disposal, municipal solid waste, SCR low dust/kg/CH U","disposal, municipal solid waste, SNCR/kg/CH U","disposal, municipal solid waste, scrubber sludge, to residual material landfill/kg/CH U","disposal, municipal solid waste, scrubber sludge, to slag compartment/kg/CH U","disposal, municipal solid waste, slag, to slag compartment/kg/CH U","electricity, low voltage, at grid/kWh/CH U","disposal, municipal solid waste, to municipal incineration with dry RGR/kg/CH U","disposal, municipal solid waste, to municipal incineration with wet RGR/kg/CH U","treatment, fly ash, external FLUWA (without landfill)/CH U","processing, hydroxid slugde from acid fly ash scrubbing  (waelz process)/kg/DE U","treatment, fly ash, external FLUREC (without landfill)/CH U","Sodium hydroxide, 50% in H2O, production mix, at plant/RER U","Quicklime, milled, packed, at plant/CH U","Lime, hydrated, packed, at plant/CH U","Sodium chloride, brine solution, at plant/RER U","Hydrochloric acid, 30% in H2O, at plant/RER U","Iron (III) chloride, 40% in H2O, at plant/CH U","Chemicals organic, at plant/GLO U","Chemicals inorganic, at plant/GLO U","Ammonia, liquid, at regional storehouse/CH U","electricity, low voltage, at grid/kWh/CH U","Soda, powder, at plant/RER U","Lignite briquettes, at plant/DE U","propane/ butane, at refinery/kg/CH U","natural gas, low pressure, at consumer/MJ/CH U","light fuel oil, at regional storage/kg/CH U","tap water, at user/kg/CH U","Transport, freight, rail/RER U","Transport, lorry 20-28t, fleet average/CH U","disposal, municipal solid waste, fly ash, to underground deposit/kg/CH U","disposal, municipal solid waste,GFresidue, to underground deposit/kg/CH U","Transport, freight, rail/RER U","Transport, lorry 20-28t, fleet average/CH U"]
["Total","MJ",4.3981766999999998E-2,7.0381491000000001E-3,4.3155403999999998E-3,0.32197184000000001,8.4269601E-5,1.9672436999999998E-3,2.6601681000000001E-4,6.9567263000000004E-2,9.0594920000000005,4.4780984000000003E-2,4.5193255000000002E-2,4.5104226000000001,1.6215519,8.5511616999999998,19.532069,5.5547928999999998,4.2638806999999996,1.8329378000000001,15.287551000000001,13.924802,63.419935000000002,24.859680000000001,41.033408000000001,9.0594920000000005,5.1724734000000003,1.4466564,54.237850999999999,1.1513690999999999,54.859124000000001,4.9611376999999998E-3,0.67223445000000004,3.2034688,4.3981766999999998E-2,1.1184209000000001E-2,0.67059853000000003,3.2025207]
["Non renewable, fossil","MJ",3.7469163999999999E-2,6.7206395999999998E-3,3.7155888E-3,0.31568456,6.8079189999999996E-5,1.6759892E-3,2.5401797999999998E-4,6.6429255000000006E-2,1.2414366999999999,4.0647394000000003E-2,4.0891973999999998E-2,2.7510767999999999,1.2032733,4.3290417999999997,12.531304,5.0224906999999996,3.8766254999999998,1.4060474000000001,10.704404,9.1849065999999997,59.985295999999998,20.386944,40.130274999999997,1.2414366999999999,4.5043801999999999,1.4358839000000001,53.695363,1.1486810000000001,54.348391999999997,1.4883919E-3,0.48674073000000001,3.0399478000000002,3.7469163999999999E-2,9.5289195999999996E-3,0.48471788999999998,3.0361299000000002]
["Non-renewable, nuclear","MJ",6.5125421000000001E-3,3.1749394E-4,5.9994743E-4,6.2870471999999997E-3,1.6190310000000001E-5,2.9125176999999998E-4,1.1998241E-5,3.1378542999999999E-3,7.8180541999999997,4.1335408000000001E-3,4.3012310999999996E-3,1.7593437999999999,0.41827776,4.2221165000000003,7.0007561999999997,0.53225487999999999,0.38720954000000002,0.4268882,4.5831382999999999,4.7398851000000004,3.4346279000000002,4.4713412000000003,0.90308798000000001,7.8180541999999997,0.66807402000000005,1.0772479E-2,0.54242674000000002,2.6865510000000001E-3,0.51065961000000004,3.4727440999999999E-3,0.1854932,0.16351178,6.5125421000000001E-3,1.6552742E-3,0.18588018000000001,0.16638222]
["Renewable, biomass","MJ",0,0,0,0,0,0,0,0,0,0,0,0,0,0,0,0,0,0,0,0,0,0,0,0,0,0,0,0,0,0,0,0,0,0,0,0]
["Renewable, wind, solar, geothermal","MJ",0,0,0,0,0,0,0,0,0,0,0,0,0,0,0,0,0,0,0,0,0,0,0,0,0,0,0,0,0,0,0,0,0,0,0,0]
["Renewable, water","MJ",0,0,0,0,0,0,0,0,0,0,0,0,0,0,0,0,0,0,0,0,0,0,0,0,0,0,0,0,0,0,0,0,0,0,0,0]
["Waste heat","MJ",0,0,0,0,0,0,0,0,0,0,0,0,0,0,0,0,0,0,0,0,0,0,0,0,0,0,0,0,0,0,0,0,0,0,0,0]
["Non-renewable, land transformation","MJ",6.0307935000000002E-8,1.5547731000000002E-8,4.2055423000000003E-9,2.4174786000000002E-7,1.0137274E-10,2.6977373999999998E-9,5.8770438999999996E-10,1.5365557999999999E-7,9.8455875999999997E-7,4.8976805000000003E-8,4.9303877999999997E-8,2.0240851999999999E-6,9.0733049000000004E-7,3.3446413E-6,8.8889821999999997E-6,4.7331895E-5,4.5588011999999997E-5,2.1995479E-6,9.2337258000000006E-6,1.0299145000000001E-5,1.1267948000000001E-5,1.3950614999999999E-3,4.4918759999999998E-5,9.8455875999999997E-7,1.9192275000000001E-5,1.6356180999999999E-8,6.1005699000000002E-5,1.5161720000000001E-6,7.1923532999999994E-5,1.7406039E-9,5.2403291000000004E-7,9.2521383999999994E-6,6.0307935000000002E-8,1.5340188000000001E-8,4.6857725000000001E-7,8.5702374000000007E-6]
["Secondary energy and waste","MJ",0,0,0,0,0,0,0,0,0,0,0,0,0,0,0,0,0,0,0,0,0,0,0,0,0,0,0,0,0,0,0,0,0,0,0,0]
[]
[]
[]
[]
[]
["Calculation: ","Compare"]
["Results: ","Impact assessment"]
["Product 1: ","1 kg disposal, municipal solid waste, fly ash, to residual material landfill/kg/CH U (of project naturemade)"]
["Product 2: ","1 kg disposal, municipal solid waste, fly ash, to slag compartment/kg/CH U (of project naturemade)"]
["Product 3: ","1 kg disposal, municipal solid waste, SCR high dust/kg/CH U (of project naturemade)"]
["Product 4: ","1 kg disposal, municipal solid waste, SCR low dust/kg/CH U (of project naturemade)"]
["Product 5: ","1 kg disposal, municipal solid waste, SNCR/kg/CH U (of project naturemade)"]
["Product 6: ","1 kg disposal, municipal solid waste, scrubber sludge, to residual material landfill/kg/CH U (of project naturemade)"]
["Product 7: ","1 kg disposal, municipal solid waste, scrubber sludge, to slag compartment/kg/CH U (of project naturemade)"]
["Product 8: ","1 kg disposal, municipal solid waste, slag, to slag compartment/kg/CH U (of project naturemade)"]
["Product 9: ","1 kWh electricity, low voltage, at grid/kWh/CH U (of project Ecoinvent unit processes)"]
["Product 10: ","1 kg disposal, municipal solid waste, to municipal incineration with dry RGR/kg/CH U (of project naturemade)"]
["Product 11: ","1 kg disposal, municipal solid waste, to municipal incineration with wet RGR/kg/CH U (of project naturemade)"]
["Product 12: ","1 kg treatment, fly ash, external FLUWA (without landfill)/CH U (of project naturemade)"]
["Product 13: ","1 kg processing, hydroxid slugde from acid fly ash scrubbing  (waelz process)/kg/DE U (of project naturemade)"]
["Product 14: ","1 kg treatment, fly ash, external FLUREC (without landfill)/CH U (of project naturemade)"]
["Product 15: ","1 kg Sodium hydroxide, 50% in H2O, production mix, at plant/RER U (of project Ecoinvent unit processes)"]
["Product 16: ","1 kg Quicklime, milled, packed, at plant/CH U (of project Ecoinvent unit processes)"]
["Product 17: ","1 kg Lime, hydrated, packed, at plant/CH U (of project Ecoinvent unit processes)"]
["Product 18: ","1 kg Sodium chloride, brine solution, at plant/RER U (of project Ecoinvent unit processes)"]
["Product 19: ","1 kg Hydrochloric acid, 30% in H2O, at plant/RER U (of project Ecoinvent unit processes)"]
["Product 20: ","1 kg Iron (III) chloride, 40% in H2O, at plant/CH U (of project Ecoinvent unit processes)"]
["Product 21: ","1 kg Chemicals organic, at plant/GLO U (of project Ecoinvent unit processes)"]
["Product 22: ","1 kg Chemicals inorganic, at plant/GLO U (of project Ecoinvent unit processes)"]
["Product 23: ","1 kg Ammonia, liquid, at regional storehouse/CH U (of project Ecoinvent unit processes)"]
["Product 24: ","1 kWh electricity, low voltage, at grid/kWh/CH U (of project Ecoinvent unit processes)"]
["Product 25: ","1 kg Soda, powder, at plant/RER U (of project Ecoinvent unit processes)"]
["Product 26: ","1 MJ Lignite briquettes, at plant/DE U (of project Ecoinvent unit processes)"]
["Product 27: ","1 kg propane/ butane, at refinery/kg/CH U (of project Ecoinvent unit processes)"]
["Product 28: ","1 MJ natural gas, low pressure, at consumer/MJ/CH U (of project Ecoinvent unit processes)"]
["Product 29: ","1 kg light fuel oil, at regional storage/kg/CH U (of project Ecoinvent unit processes)"]
["Product 30: ","1 kg tap water, at user/kg/CH U (of project Ecoinvent unit processes)"]
["Product 31: ","1 tkm Transport, freight, rail/RER U (of project Ecoinvent unit processes)"]
["Product 32: ","1 tkm Transport, lorry 20-28t, fleet average/CH U (of project Ecoinvent unit processes)"]
["Product 33: ","1 kg disposal, municipal solid waste, fly ash, to underground deposit/kg/CH U (of project naturemade)"]
["Product 34: ","1 kg disposal, municipal solid waste,GFresidue, to underground deposit/kg/CH U (of project naturemade)"]
["Method: ","Ecological Scarcity 2013, categories V1.05 / Ecological scarcity 2013"]
["Indicator: ","Single score"]
["Skip categories: ","Never"]
["Default units: ","Yes"]
["Exclude infrastructure processes: ","No"]
["Exclude long-term emissions: ","No"]
["Sorted on item: ","Impact category"]
["Sort order: ","Ascending"]
[]
["Impact category","Unit","disposal, municipal solid waste, fly ash, to residual material landfill/kg/CH U","disposal, municipal solid waste, fly ash, to slag compartment/kg/CH U","disposal, municipal solid waste, SCR high dust/kg/CH U","disposal, municipal solid waste, SCR low dust/kg/CH U","disposal, municipal solid waste, SNCR/kg/CH U","disposal, municipal solid waste, scrubber sludge, to residual material landfill/kg/CH U","disposal, municipal solid waste, scrubber sludge, to slag compartment/kg/CH U","disposal, municipal solid waste, slag, to slag compartment/kg/CH U","electricity, low voltage, at grid/kWh/CH U","disposal, municipal solid waste, to municipal incineration with dry RGR/kg/CH U","disposal, municipal solid waste, to municipal incineration with wet RGR/kg/CH U","treatment, fly ash, external FLUWA (without landfill)/CH U","processing, hydroxid slugde from acid fly ash scrubbing  (waelz process)/kg/DE U","treatment, fly ash, external FLUREC (without landfill)/CH U","Sodium hydroxide, 50% in H2O, production mix, at plant/RER U","Quicklime, milled, packed, at plant/CH U","Lime, hydrated, packed, at plant/CH U","Sodium chloride, brine solution, at plant/RER U","Hydrochloric acid, 30% in H2O, at plant/RER U","Iron (III) chloride, 40% in H2O, at plant/CH U","Chemicals organic, at plant/GLO U","Chemicals inorganic, at plant/GLO U","Ammonia, liquid, at regional storehouse/CH U","electricity, low voltage, at grid/kWh/CH U","Soda, powder, at plant/RER U","Lignite briquettes, at plant/DE U","propane/ butane, at refinery/kg/CH U","natural gas, low pressure, at consumer/MJ/CH U","light fuel oil, at regional storage/kg/CH U","tap water, at user/kg/CH U","Transport, freight, rail/RER U","Transport, lorry 20-28t, fleet average/CH U","disposal, municipal solid waste, fly ash, to underground deposit/kg/CH U","disposal, municipal solid waste,GFresidue, to underground deposit/kg/CH U","Transport, freight, rail/RER U","Transport, lorry 20-28t, fleet average/CH U"]
["Total","Pt",23.663157000000002,9.6193732999999995,239.58794,250.98740000000001,240.50259,1.2041263,9.6799116000000005,17.848849999999999,347.01094999999998,11.448225000000001,15.901363999999999,316.86639000000002,315.07816000000003,687.87487999999996,1351.6804999999999,603.85383999999999,465.80642,168.86402000000001,1065.5198,1418.9268,1855.3463999999999,2374.0572000000002,2014.547,347.01094999999998,566.05816000000004,24.275732999999999,1165.1192000000001,14.005338,1360.0283999999999,0.35357029000000001,65.497545000000002,289.41037999999998,23.663157000000002,3.4813831999999998,64.992420999999993,283.19193000000001]
["Water resources","Pt",2.3829646000000002E-3,3.4305916000000001E-4,6.3174103999999995E-2,6.4531910999999997E-2,6.2842578999999996E-2,1.0658759E-4,1.295659E-5,3.3913596999999998E-3,0.57969314999999999,2.9660899000000002E-3,3.0175638999999999E-3,0.84422759000000003,0.13790247999999999,1.4794164999999999,4.0766553999999999,0.10451433,0.12106264,0.36855145,2.7780653000000002,2.5826026,2.9948275999999998,3.9606321000000002,0.43351868999999998,0.57969314999999999,1.9807737999999999,6.5288880999999993E-2,0.44499661000000001,1.4829089999999999E-3,0.44721794999999998,6.9221152999999994E-2,4.6762063999999999E-2,6.7206029E-2,2.3829646000000002E-3,6.0598610000000002E-4,3.9677723999999998E-2,6.2864059999999999E-2]
["Energy resources","Pt",0.15392587999999999,2.4549258000000001E-2,1.4951864E-2,1.0952662,2.9492850999999999E-4,6.8848874999999999E-3,9.2787429999999997E-4,0.24265247000000001,32.511873999999999,0.15555387000000001,0.15700816000000001,15.812347000000001,5.6575325000000003,30.179618000000001,68.458156000000002,19.934186,15.348174,6.4529350000000001,53.521808999999998,48.967806000000003,219.08707000000001,86.299509999999998,141.16598999999999,32.511873999999999,18.043088999999998,4.9706503,189.13634999999999,3.9107859999999999,191.34309999999999,1.79845E-2,2.3531678,11.180685,0.15392587999999999,3.9142024999999997E-2,2.3476542999999999,11.177818]
["Mineral resources","Pt",0.27911624000000002,9.0386800000000003E-2,2.8758287E-2,4.5893613999999999E-2,1.1131022E-3,1.2488733E-2,3.4128515999999999E-3,0.89359242999999999,3.0074573,0.46395301999999999,0.46762046000000002,4.6982539000000001,3.6813438000000001,54.238996999999998,43.841053000000002,1.5562395,1.2451232000000001,8.3088615000000008,33.562395000000002,54.564551999999999,12.57699,58.754344000000003,19.809985000000001,3.0074573,8.1779069,1.415772E-2,10.846503999999999,0.16493004,15.144318,1.2832758E-2,2.3771355000000001,8.2057407999999992,0.27911624000000002,7.1053941999999995E-2,2.3607578999999999,8.0425234999999997]
["Land use","Pt",6.8217455999999996E-2,1.4992274999999999E-2,4.4104134999999999E-4,3.5519473999999999E-3,5.1173006000000003E-5,3.0522675000000002E-3,5.6743020000000002E-4,0.14831428999999999,0.24060843000000001,2.4268865000000001E-2,2.4439269999999999E-2,0.54957632000000001,0.80096230000000002,0.76135048999999999,2.5435582999999999,1.8247549999999999,1.7807928,0.89771031000000001,2.6630533000000001,3.9909126000000001,1.3959309,8.5502736000000006,1.9939745,0.24060843000000001,2.2013638000000002,5.2654984000000002E-2,1.1097272,9.6639580999999999E-3,2.1007343999999999,4.9128599000000002E-3,0.31743468000000002,0.63171394999999997,6.8217455999999996E-2,1.7365285000000001E-2,0.31502109,0.60742872000000003]
["Land use, high CF for intensive forest","Pt",0,0,0,0,0,0,0,0,0,0,0,0,0,0,0,0,0,0,0,0,0,0,0,0,0,0,0,0,0,0,0,0,0,0,17.349277000000001,89.170011000000002]
["Global warming","Pt",3.0842928000000001,0.14214959999999999,1.9456199000000001,10.512638000000001,3.0220817000000002,0.13793253999999999,5.3754854999999999E-3,1.4049305999999999,46.424238000000003,1.5684742,1.5824039999999999,125.25824,176.14897999999999,144.09956,466.98257999999998,451.22496999999998,347.43714999999997,49.317712999999998,367.09442000000001,341.57342,873.79286999999999,840.78590999999994,974.72853999999995,46.424238000000003,199.94636,15.108796,274.69418000000002,5.4171772999999996,285.46562999999998,6.8249200999999995E-2,17.392151999999999,88.968673999999993,3.0842928000000001,0.78388758000000003,8.9008539000000001E-3,5.8930559E-2]
["Global warming, specific CF for aviation","Pt",0,0,0,0,0,0,0,0,0,0,0,0,0,0,0,0,0,0,0,0,0,0,0,0,0,0,0,0,0,0,0,0,0,0,12.949282999999999,85.660822999999993]
["Ozone layer depletion","Pt",8.6245022000000005E-4,1.2835928999999999E-4,2.7748569000000001E-4,1.0998921E-2,4.3478971000000004E-6,3.8576204000000003E-5,4.8514984000000002E-6,1.2686902999999999E-3,0.37476998,7.1396834999999995E-4,7.4032391000000003E-4,0.51080935999999999,2.8162631E-2,0.86965970000000004,0.40950910000000001,0.13153988999999999,0.10023281000000001,3.9678707000000001E-2,10.604989,13.184193,1.1444681999999999,2.3177843,1.0926971000000001,0.37476998,4.5381037999999999E-2,5.5510456999999995E-4,1.1938454000000001,4.7372127E-2,0.97769720000000004,1.7689913E-4,1.0648898E-2,6.2629972000000006E-2,8.6245022000000005E-4,2.1931412E-4,2.0029417,4.6801484999999996]
["Main air pollutants and PM","Pt",0.86489713999999995,0.14612826000000001,0.10585163,0.85583717999999998,2.3006365000000001E-2,3.8684617999999997E-2,5.5270802999999999E-3,1.4443718999999999,22.606687999999998,1.292087,1.3051486999999999,32.120448000000003,24.506091000000001,66.353768000000002,176.0779,67.482016999999999,52.282868000000001,27.678225999999999,156.33019999999999,161.78927999999999,304.47161,501.05318999999997,309.73595,22.606687999999998,161.55857,2.9452337000000002,212.73125999999999,1.8602188,261.64920000000001,3.8392094000000002E-2,13.128126,87.802469000000002,0.86489713999999995,0.21991728999999999,2.1529916999999998,6.6787698000000004]
["Main air pollutants and PM, specific CF ","Pt",0,0,0,0,0,0,0,0,0,0,0,0,0,0,0,0,0,0,0,0,0,0,0,0,0,0,0,0,0,0,0,0,0,0,1.2046124,11.86307]
["Carcinogenic substances into air","Pt",0.53131017999999997,6.7498315999999997E-3,237.31598,237.44311999999999,237.39071999999999,2.3759768000000001E-2,2.5522609000000002E-4,6.6704599000000003E-2,2.4448056,0.60559883999999997,0.60878246000000003,3.3611255999999998,2.5247476999999998,35.418613999999998,17.478728,2.4465503000000002,2.1136423999999998,5.0451014000000001,16.946725000000001,23.195274000000001,181.53735,24.172899999999998,20.089151999999999,2.4448056,11.654776,0.24770075,10.849081,0.12540836999999999,13.241144999999999,1.2843461E-2,1.9927223999999999,4.6824918000000002,0.53131017999999997,0.13501832,0.37475911000000001,5.3534388999999996]
["Heavy metals into air","Pt",0.14323076000000001,9.3465218999999999E-3,1.0626053999999999E-2,6.9860771000000002E-2,9.101917E-4,6.4055900000000001E-3,3.5338999000000002E-4,9.2363096000000006E-2,26.007570999999999,6.3240816000000004,6.3275690000000004,38.612586,72.631754999999998,162.93852999999999,191.20972,3.0826514999999999,2.4816254999999998,39.360315999999997,150.61358000000001,245.55982,57.660893999999999,142.21942000000001,252.38511,26.007570999999999,41.926451999999998,0.24487540999999999,22.189070999999998,0.16213525000000001,27.606217000000001,1.6313989000000001E-2,2.1587752,6.6138893999999997,0.14323076000000001,3.6405809999999997E-2,2.4629102,14.66248]
["Water pollutants","Pt",0.20879292999999999,4.4851051000000003E-2,6.5055369999999996E-3,0.11525535000000001,1.4287193999999999E-4,1.1640922999999999E-2,6.1127928E-3,0.86422403999999997,1.51322,0.10347632,3.0649109999999999,4.8365796999999997,1.6956955,7.8174349999999997,21.438213000000001,20.193238000000001,15.662739999999999,3.47322,24.423024000000002,18.381921999999999,55.456063,265.01307000000003,122.82968,1.51322,28.007054,0.14017067999999999,213.89509000000001,0.18936438999999999,296.51449000000002,2.8026663000000002E-3,1.3963277000000001,14.299462,0.20879292999999999,7.8903216999999998E-2,5.3811305000000002E-4,3.1216123999999999E-3]
["POP into water","Pt",6.2134157000000002E-2,1.3721852999999999E-2,1.9714060999999998E-3,7.7638599000000004E-3,5.2759130000000003E-5,2.7794425999999998E-3,5.1873708000000002E-4,0.13563094000000001,0.35976415,4.7172699999999998E-2,4.7351506000000002E-2,1.0658293999999999,0.65382178000000002,1.6615489000000001,4.1855357,10.624292000000001,8.1905572000000006,1.1121729,5.4069152999999996,4.1173910999999999,8.0426939999999991,14.777177999999999,44.472707999999997,0.35976415,1.6744729,1.4738859E-2,115.76159,1.8576711999999999E-2,135.83770000000001,1.0044194E-3,0.53181263000000001,6.7844806999999996,6.2134157000000002E-2,1.5805013999999999E-2,3.6797251000000003E-2,3.1061649]
["Heavy metals into water","Pt",16.291533000000001,6.4512982000000001,6.1744895000000001E-2,0.53229201000000004,7.4842436E-4,9.1308767999999998E-2,8.3377143,1.3527579000000001,3.7495609000000001,0.64880821,2.066344,33.691504999999999,2.5835352999999999,57.533920000000002,107.78569,9.5265956000000003,7.4095405999999997,11.042987999999999,73.117596000000006,113.18794,64.709434999999999,239.29604,80.538584999999998,3.7495609000000001,64.107287999999997,6.1806272000000002E-2,94.038210000000007,1.9628097,103.16464000000001,1.3321924000000001E-2,2.3884498000000001,15.19806,16.291533000000001,0.33168811999999998,1.4968624E-6,1.4290478E-6]
["Pesticides into soil","Pt",1.2973706000000001E-5,4.86701E-6,2.1672867E-6,1.2770698000000001E-5,3.9306303999999999E-8,5.8035656999999999E-7,1.8394528999999999E-7,4.8094747999999997E-5,1.5074235999999999E-3,1.2639645999999999E-5,7.6462329999999997E-4,3.9877271000000004E-3,7.3772542E-4,1.0521144E-2,5.4057792E-2,1.1204772999999999E-2,1.1028648E-2,1.4580119E-3,5.7310100000000003E-2,3.7434390999999997E-2,5.1115129999999998E-3,4.7729486000000002E-2,3.4979661E-3,1.5074235999999999E-3,3.3482969000000001E-2,1.3636660999999999E-5,1.8856242000000001E-3,3.6494025000000002E-5,3.0637470999999999E-3,1.3837992000000001E-6,5.6321121999999997E-4,3.1651275E-3,1.2973706000000001E-5,3.3001510999999998E-6,0.18352846,0.13053496000000001]
["Heavy metals into soil","Pt",7.1639312000000002E-3,3.3097099E-3,4.4129127999999998E-4,2.7512105999999998E-3,9.1368346999999996E-6,3.2050986E-4,1.2514412999999999E-4,3.2697783000000001E-2,1.036635,4.7947247E-3,3.3699914999999997E-2,0.50799238000000002,0.12749506999999999,1.2133366999999999,4.3663036999999996,0.15330070000000001,0.12209718,0.27890140000000002,3.8878282,3.3789001999999999,0.93171877000000003,2.7614681999999999,0.69851753999999999,1.036635,1.4835582,1.2004648000000001E-3,0.16232125999999999,2.8429358999999999E-3,0.73528150000000003,5.9469310999999997E-4,3.7438875000000003E-2,3.1048629999999999,7.1639312000000002E-3,1.8230716999999999E-3,15.283021,37.165452999999999]
["Radioactive substances into air","Pt",5.8087977999999997E-8,2.3824637E-9,4.7167786999999999E-9,4.9504143999999997E-8,1.3086824999999999E-10,2.5977732E-9,9.0047066999999995E-11,2.3544909000000001E-8,7.1063163000000006E-5,3.4608491000000002E-8,3.6075299000000003E-8,1.5072277E-5,3.2130557E-6,3.6637317000000002E-5,5.5163334000000001E-5,4.7642616999999998E-6,3.4545072999999999E-6,3.3535886000000001E-6,3.5973663999999999E-5,3.7496010000000002E-5,1.3857502E-5,3.5410602000000002E-5,7.1327694999999996E-6,7.1063163000000006E-5,5.3319366000000004E-6,8.5018443999999997E-8,4.5100849000000001E-6,2.1074010000000001E-8,4.1565984000000003E-6,3.1251650999999999E-8,1.4952583E-6,1.4115264E-6,5.8087977999999997E-8,1.4763727E-8,7.5621869999999994E-2,0.17946075]
["Radioactive substances into water","Pt",4.4986022999999997E-3,2.1664623999999999E-4,6.2068401E-4,6.5091792000000004E-3,1.1736255999999999E-5,2.0118651E-4,8.1885461000000004E-6,2.1410833999999999E-3,5.2085043000000004,3.6184928999999999E-3,3.7348200999999998E-3,1.3967422,0.36965824000000003,3.3091046999999998,7.2769174000000003,0.37058867000000001,0.27128173999999999,0.4389576,4.7315018000000002,4.8561050999999997,1.8092766,4.6518480000000002,0.92159915999999997,5.2085043000000004,0.66475680999999998,1.1188718E-2,0.49062233,2.3545146E-3,0.48575789000000003,2.4005475E-3,0.18242852000000001,0.12487076,4.4986022999999997E-3,1.1434226E-3,5.8441254000000002,4.5888891000000003]
["Noise","Pt",9.1574801999999997E-2,3.9398790000000003E-2,4.9146368999999999E-4,8.6752424999999994E-3,9.8967279999999995E-5,4.0971823000000001E-3,1.4897173000000001E-3,0.38923368000000003,0.27467035000000001,6.5059573999999995E-2,6.5432773E-2,3.9464910999999998,10.821344,1.8451687000000001,4.5942335999999999,1.0490584999999999,0.87672196999999996,0.45258025000000002,8.9169595000000008,7.3331379999999999,9.458952,16.940819000000001,13.102395,0.27467035000000001,2.6371652999999999,4.7243427000000001E-3,0.75786602000000003,2.5752726E-2,8.9103779000000003,1.5858673E-3,15.281779999999999,37.030284000000002,9.1574801999999997E-2,2.3306944E-2]
["Non radioactive waste to deposit","Pt",1.7000702000000001,2.6241563999999999,1.1114292E-2,9.3908075000000008E-3,8.9475564000000003E-5,0.85685986000000003,1.3172166000000001,10.699005,0.16316553,1.6141180000000001E-2,1.6619109E-2,0.52873435000000002,0.10898555,1.0206367000000001,4.1985266000000001,0.21154888999999999,0.19331947999999999,0.87714535000000005,3.3185630000000002,220.08234999999999,3.7207881999999999,18.271477000000001,1.6419296000000001,0.16316553,0.84151980999999998,4.3248456999999997E-2,0.58103667000000003,2.6485369000000002E-2,0.70096948000000003,3.4322661000000003E-4,8.2403076000000006E-2,0.20016456999999999,1.7000702000000001,1.6821044000000001]
["Radioactive waste to deposit","Pt",0.16914056,7.6418475E-3,1.9372540000000001E-2,0.20305674000000001,4.1641645000000001E-4,7.5642595E-3,2.8883461000000002E-4,7.5522516999999997E-2,200.50613999999999,0.12144402999999999,0.12577661000000001,49.120902999999998,12.599410000000001,117.12366,226.70304999999999,13.926587,10.158459000000001,13.717501,147.54486,152.14374000000001,56.550362999999997,144.18355,28.903161000000001,200.50613999999999,21.074186000000001,0.34872787,16.235547,7.7940094000000001E-2,15.70082,9.0588613999999998E-2,5.8194150999999996,4.4495294999999997,0.16914056,4.2990141000000003E-2]

{"sheet":"Prüfwert","index":5,"n_rows":77,"n_cols":13,"rows_kept":77,"cut":false,"hidden":true,"merged":[[6,0,6,1],[7,0,7,1]]}
["Referenz",null,1,2,3,4,5,6,7,8,9,10,11]
[null,null,"Grenzwert Strom","Grenzwert Wärme","Grenzwert Entsorgungsfunktion","Grenzwert Primäraluminium","Grenzwert Primärkupfer","Grenzwert Primär-Gold","Grenzwert Primär-Edelstahl","Grenzwert Roheisen","Grenzwert Primärzink","Grenzwert Zinkkonzentrat","Grenzwert Bleikonzentrat"]
["Zeile 1 ",null,30,31,12,34,33,36,35,32,38,37,37]
["Zeile 2",{"$nulls":4},49,49,null,50,50,null,38,38]
["Eingabe 1",null,{"$f":"INDEX(Eingabe!$1:$1048576,MATCH(C$3,Eingabe!$A:$A,0),3)","v":0},{"$f":"INDEX(Eingabe!$1:$1048576,MATCH(D$3,Eingabe!$A:$A,0),3)","v":0},{"$f":"INDEX(Eingabe!$1:$1048576,MATCH(E$3,Eingabe!$A:$A,0),3)","v":0},{"$f":"INDEX(Eingabe!$1:$1048576,MATCH(F$3,Eingabe!$A:$A,0),3)","v":0},{"$f":"INDEX(Eingabe!$1:$1048576,MATCH(G$3,Eingabe!$A:$A,0),3)","v":0},{"$f":"INDEX(Eingabe!$1:$1048576,MATCH(H$3,Eingabe!$A:$A,0),3)","v":0},{"$f":"INDEX(Eingabe!$1:$1048576,MATCH(I$3,Eingabe!$A:$A,0),3)","v":0},{"$f":"INDEX(Eingabe!$1:$1048576,MATCH(J$3,Eingabe!$A:$A,0),3)","v":0},{"$f":"INDEX(Eingabe!$1:$1048576,MATCH(K$3,Eingabe!$A:$A,0),3)","v":0},{"$f":"INDEX(Eingabe!$1:$1048576,MATCH(L$3,Eingabe!$A:$A,0),3)","v":0},{"$f":"INDEX(Eingabe!$1:$1048576,MATCH(M$3,Eingabe!$A:$A,0),3)","v":0}]
["Eingabe 2",{"$nulls":4},{"$f":"INDEX(Eingabe!$1:$1048576,MATCH(F$4,Eingabe!$A:$A,0),3)","v":0},{"$f":"INDEX(Eingabe!$1:$1048576,MATCH(G$4,Eingabe!$A:$A,0),3)","v":0},null,{"$f":"INDEX(Eingabe!$1:$1048576,MATCH(I$4,Eingabe!$A:$A,0),3)","v":0},{"$f":"INDEX(Eingabe!$1:$1048576,MATCH(J$4,Eingabe!$A:$A,0),3)","v":0},null,{"$f":"INDEX(Eingabe!$1:$1048576,MATCH(L$4,Eingabe!$A:$A,0),3)","v":0},{"$f":"INDEX(Eingabe!$1:$1048576,MATCH(M$4,Eingabe!$A:$A,0),3)","v":0}]
["Umrechnungsfaktor",null,{"$f":"IF(Eingabe!$E$47=TRUE,C5*0.5*1000,C5*1000)","v":0},{"$f":"D5*1000","v":0},{"$f":"IF(Eingabe!$E$47=TRUE,E5*Ergebnis!$I$24*1000,E5*1000)","v":0},{"$f":"IF(Eingabe!$E$47=TRUE,IF(F5>0,F5*0.97003745*Ergebnis!$I$24*1000,F6*0.75730994*Ergebnis!$I$24*1000),IF(F5>0,F5*0.97003745*1000,F6*0.75730994*1000))","v":0},{"$f":"IF(Eingabe!$E$47=TRUE,IF(G5>0,G5*0.7733333*Ergebnis!$I$24*1000,G6*0.16959064*Ergebnis!$I$24*1000),IF(G5>0,G5*0.7733333*1000,G6*0.16959064*1000))","v":0},{"$f":"IF(Eingabe!$E$47=TRUE,H5*Ergebnis!$I$24*1000,H5*1000)","v":0},{"$f":"IF(Eingabe!$E$47=TRUE,IF(I5>0,I5*0.91428571*Ergebnis!$I$24*1000,I6*0.02044728*Ergebnis!$I$24*1000),IF(I5>0,I5*0.91428571*1000,I6*0.02044728*1000))","v":0},{"$f":"IF(Eingabe!$E$47=TRUE,IF(J5>0,J5*Ergebnis!$I$24*1000,J6*0.97763578*Ergebnis!$I$24*1000),IF(J5>0,J5*1000,J6*0.97763578*1000))","v":0},{"$f":"IF(Eingabe!$E$47=TRUE,K5*0.000954*Eingabe!$C$12*Ergebnis!$I$24*1000,K5*0.000954*Eingabe!$C$12*1000)","v":0},{"$f":"IF(Eingabe!$E$47=TRUE,L5*0.0010336*Eingabe!$C$12*Ergebnis!$I$24*1000+L6*0.0000256*Eingabe!$C$12*Ergebnis!$I$24*1000,L5*0.0010336*Eingabe!$C$12*1000+L6*0.0000256*Eingabe!$C$12*1000)","v":0},{"$f":"IF(Eingabe!$E$47=TRUE,M5*0.0002176*Eingabe!$C$12*Ergebnis!$I$24*1000+M6*0.0002176*Eingabe!$C$12*Ergebnis!$I$24*1000,M5*0.0002176*Eingabe!$C$12*1000+M6*0.0002176*Eingabe!$C$12*1000)","v":0}]
["EI'99-aggregated, Hierarchist",null,{"$f":"-C$7*C$39","v":0},{"$f":"-D$7*D$39","v":0},{"$f":"-E$7*L$39","v":0},{"$f":"-F$7*G$39","v":0},{"$f":"-G$7*H$39","v":0},{"$f":"-H$7*I$39","v":0},{"$f":"-I$7*J$39","v":0},{"$f":"-J$7*F$39","v":0},{"$f":"-K$7*K$39","v":0},{"$f":"-L$7*M$39","v":0},{"$f":"-M$7*E$39","v":0}]
[]
[]
[]
[]
[]
[]
["Calculation: ","Vergleichen"]
["Results: ","Wirkungsabschätzung"]
["Product 1: ","1 kWh threshold value recycling star, electricity/kWh/CH U (of project 529 naturemade)"]
["Product 2: ","1 kWh threshold value recycling star, heat/MJ/CH U (of project 529 naturemade)"]
["Product 3: ","1 kg threshold value recycling star, lead concentrate/kg/CH U (of project 529 naturemade)"]
["Product 4: ","1 kg threshold value recycling star, pig iron/kg/CH U (of project 529 naturemade)"]
["Product 5: ","1 kg threshold value recycling star, primary aluminium/kg/CH U (of project 529 naturemade)"]
["Product 6: ","1 kg threshold value recycling star, primary copper/kg/CH U (of project 529 naturemade)"]
["Product 7: ","1 kg threshold value recycling star, primary gold/kg/CH U (of project 529 naturemade)"]
["Product 8: ","1 kg threshold value recycling star, primary stainless steal/kg/CH U (of project 529 naturemade)"]
["Product 9: ","1 kg threshold value recycling star, primary zinc/kg/CH U (of project 529 naturemade)"]
["Product 10: ","1 kg threshold value recycling star, waste disposal/kg/CH U (of project 529 naturemade)"]
["Product 11: ","1 kg threshold value recycling star, zinc concentrate/kg/CH U (of project 529 naturemade)"]
["Methode: ","Eco-indicator 99 (H) V2.09 / Europe EI 99 H/A"]
["Indikator: ","Einzelergebnis"]
["Skip categories: ","Nie"]
["Default units: ","Ja"]
["Infrastrukturprozesse ausschließen: ","Nein"]
["Langzeitemissionen ausschließen: ","Ja"]
["Per impact category: ","Nein"]
["Sorted on item: ","Schadenskategorie"]
["Sort order: ","Aufsteigend"]
[]
["Schadenskategorie","Einheit","threshold value recycling star, electricity/kWh/CH U","threshold value recycling star, heat/MJ/CH U","threshold value recycling star, lead concentrate/kg/CH U","threshold value recycling star, pig iron/kg/CH U","threshold value recycling star, primary aluminium/kg/CH U","threshold value recycling star, primary copper/kg/CH U","threshold value recycling star, primary gold/kg/CH U","threshold value recycling star, primary stainless steal/kg/CH U","threshold value recycling star, primary zinc/kg/CH U","threshold value recycling star, waste disposal/kg/CH U","threshold value recycling star, zinc concentrate/kg/CH U"]
["Summe","Pt",-7.8611529999999992E-3,-4.5013858000000004E-3,-4.3164661999999999E-2,-3.8302745999999999E-2,-0.22207225,-0.53668139999999998,-675.22329999999999,-0.24868541,-0.24039556000000001,-1.1641187E-3,-3.9830676000000002E-2]
["Human Health","Pt",-1.4366909999999999E-3,-8.1807706000000004E-4,-9.5159839000000003E-3,-3.3138857000000001E-2,-0.15072932,-0.30762673000000001,-426.20587999999998,-0.13478146999999999,-6.8111532000000002E-2,-4.997418E-4,-1.4576034999999999E-2]
["Ecosystem Quality","Pt",-5.1388599999999998E-5,-3.1099890999999999E-5,-3.0358536E-3,-9.9373019000000007E-4,3.1454539000000002E-3,-8.1644964E-2,-76.825582999999995,-7.0952605000000002E-2,-0.12017113,1.7896617E-6,-4.6501193E-3]
["Resources","Pt",-6.3730734999999997E-3,-3.6522089E-3,-3.0612824E-2,-4.1701589999999997E-3,-7.4488378999999993E-2,-0.1474097,-172.19184000000001,-4.2951331000000002E-2,-5.2112902000000003E-2,-6.6616652000000003E-4,-2.0604522E-2]
[]
[]
[]
["Energienettoeffizienz ENE"]
["Formel gemäss DIRECTIVE 2008/98/EC OF THE EUROPEAN PARLIAMENT AND OF THE COUNCIL of 19 November 2008 on waste and repealing certain Directives"]
["PDF-S. 22","Energy efficiency = (Ep-(Ef+Ei))/(0.97*(Ew+Ef))"]
[]
["MWh in GJ",null,3.6]
["MJ in GJ",null,{"$f":"1/1000","v":1E-3}]
["t in kg",null,1000]
[]
["Heizwert Erdgas","MJ/m3",37.799999999999997]
["Dichte Heizöl","kg/l",0.86]
["Heizwert Heizöl","MJ/kg",42.6]
["Dichte Propan","kg/l",0.51,"Faktenblatt CO2-Emissionsfaktoren des Treibhausgasinventars der Schweiz. 15 April 2019. Wird nicht verwendet"]
["Heizwert Propangas","MJ/kg",46.3,"Faktenblatt CO2-Emissionsfaktoren des Treibhausgasinventars der Schweiz. 15 April 2019. "]
[]
["Faktor Ep Strom",null,2.6]
["Faktor Ep Wärme",null,1.1000000000000001]
[]
["Ep Strom","GJ",{"$f":"Eingabe!C47*Prüfwert!C50*Prüfwert!C60","v":0}]
["Ep Wärme","GJ",{"$f":"Eingabe!C48*Prüfwert!C50*Prüfwert!C61","v":0}]
["Ep total ","GJ",{"$f":"C63+C64","v":0}]
[]
["Ef Erdgas","GJ",{"$f":"Eingabe!C36*Prüfwert!C54*Prüfwert!C51","v":0}]
["Ef Heizöl","GJ",{"$f":"Eingabe!C37*Prüfwert!C55*Prüfwert!C56*Prüfwert!C51","v":0}]
["Ef Propan","GJ",{"$f":"Eingabe!C35*Prüfwert!C58*Prüfwert!C51","v":0}]
["Ef total","GJ",{"$f":"C67+C68+C69","v":0}]
[]
["Ew Waste","GJ",{"$f":"Eingabe!C12*Prüfwert!C52*Eingabe!C15*Prüfwert!C51","v":0}]
[]
["Ei Import","GJ",{"$f":"Eingabe!C34*Prüfwert!C50","v":0},"Strombezug aus Netz (#23)"]
[]
["Energieverluste Rostasche und Strahlung",null,0.97]
["ENE",null,{"$f":"(C65-(C70+C74))/(C76*(C72+C70))","v":{"$error":"#DIV/0!"}}]

{"sheet":"Ergebnis pro Tonne","index":6,"n_rows":73,"n_cols":9,"rows_kept":73,"cut":false,"hidden":false,"merged":[[0,5,1,5],[0,6,1,6],[4,5,5,5],[4,6,5,7]]}
[{"$nulls":5},{"$f":"G11","v":0},{"$f":"H11","v":0}]
[]
[null," Umweltbelastung pro Tonne Abfall","Allokation der Umweltbelastung auf die Produkte","Prüfwert",null,null,"Umweltbelastung pro Tonne Abfall","Prüfwert"]
[{"$f":"Umweltdeklaration!$B5","v":"KVA (inkl. direkte Emissionen)"},{"$f":"Umweltdeklaration!H5/$G$18","v":{"$error":"#DIV/0!"}},null,null,null,"EI'99-aggregated, Hierarchist",{"$f":"B27","v":{"$error":"#DIV/0!"}},{"$f":"D27","v":{"$error":"#DIV/0!"}}]
[{"$f":"Umweltdeklaration!$B6","v":"Hilfsstoffe + importierte Energieträger"},{"$f":"Umweltdeklaration!H6/$G$18","v":{"$error":"#DIV/0!"}},null,null,null,{"$f":"IF(G5<=1,I6,I7)","v":{"$error":"#DIV/0!"}},{"$f":"G4/H4","v":{"$error":"#DIV/0!"}}]
[{"$f":"Umweltdeklaration!$B7","v":"Behandlung Flugasche (inkl. Deponie)"},{"$f":"Umweltdeklaration!H7/$G$18","v":{"$error":"#DIV/0!"}},{"$nulls":6},"Kriterium GK-KVA1 Grenzwert Umweltbelastung erfüllt"]
[{"$f":"Umweltdeklaration!$B8","v":"Deponierung Bodenasche"},{"$f":"Umweltdeklaration!H8/$G$18","v":{"$error":"#DIV/0!"}},{"$nulls":6},"Kriterium GK-KVA1 Grenzwert Umweltbelastung nicht erfüllt"]
[{"$nulls":5},"Kriterium Energienettoeffizienz ENE","Energie-nettoeffizienz ENE","Prüfwert"]
[{"$nulls":5},{"$f":"IF(G9>100%,I11,IF(G9>=H9,I9,I10))","v":{"$error":"#DIV/0!"}},{"$f":"Prüfwert!C77","v":{"$error":"#DIV/0!"}},0.65,"Kriterium LK-KVA5 Energienettoeffizienz ENE erfüllt"]
[{"$nulls":8},"Kriterium LK-KVA5 Energienettoeffizienz ENE nicht erfüllt"]
[{"$f":"Umweltdeklaration!$B9","v":"Deponierung Gewebefilterrückstände"},{"$f":"Umweltdeklaration!H9/$G$18","v":{"$error":"#DIV/0!"}},null,null,null,"Charakterisierung der ",{"$f":"Eingabe!C4","v":0},{"$f":"Eingabe!C5","v":0},"Bitte überprüfen Sie die Eingaben"]
[{"$f":"Umweltdeklaration!$B14","v":"Strom"},null,{"$f":"D12*$B$27/$D$27","v":{"$error":"#DIV/0!"}},{"$f":"Umweltdeklaration!$D14/$G$18","v":{"$error":"#DIV/0!"}}]
[{"$f":"Umweltdeklaration!$B15","v":"Wärme"},null,{"$f":"D13*$B$27/$D$27","v":{"$error":"#DIV/0!"}},{"$f":"Umweltdeklaration!$D15/$G$18","v":{"$error":"#DIV/0!"}},null,"Anlagetyp",null,null,"nass"]
[{"$f":"Umweltdeklaration!$B16","v":"Entsorgungsfunktion"},null,{"$error":"#DIV/0!"},{"$f":"Umweltdeklaration!$D16/$G$18","v":{"$error":"#DIV/0!"}},null,"Rauchgasreinigung",{"$f":"IF(Anlagentyp=1,I13,I14)","v":"nass"},null,"trocken"]
[{"$f":"Umweltdeklaration!$B17","v":"Sekundäraluminium, kg"},null,{"$error":"#DIV/0!"},{"$f":"Umweltdeklaration!$D17/$G$18","v":{"$error":"#DIV/0!"}},null,"DeNOx Technologie",{"$f":"IF(Eingabe!E9=1,I15,IF(Eingabe!E9=2,I16,I17))","v":"SCR high dust"},null,"SCR low dust"]
[{"$f":"Umweltdeklaration!$B18","v":"Sekundärkupfer, kg"},null,{"$error":"#DIV/0!"},{"$f":"Umweltdeklaration!$D18/$G$18","v":{"$error":"#DIV/0!"}},{"$nulls":4},"SCR high dust"]
[{"$f":"Umweltdeklaration!$B19","v":"Sekundär-Gold, kg"},null,{"$error":"#DIV/0!"},{"$f":"Umweltdeklaration!$D19/$G$18","v":{"$error":"#DIV/0!"}},null,"Bezugsmenge","[Tonnen/Jahr]",null,"SNCR"]
[{"$f":"Umweltdeklaration!$B20","v":"Sekundär-Edelstahl, kg"},null,{"$error":"#DIV/0!"},{"$f":"Umweltdeklaration!$D20/$G$18","v":{"$error":"#DIV/0!"}},null,"Abfallmenge",{"$f":"Ergebnis!G18","v":0}]
[]
[{"$nulls":5},"Heizwert","[MJ/kg]"]
[{"$nulls":5},"Durchschnittliche unterer Heizwert Abfall",{"$f":"Eingabe!C15","v":0}]
[]
[{"$f":"Umweltdeklaration!$B21","v":"Eisenschrott, kg"},null,{"$error":"#DIV/0!"},{"$f":"Umweltdeklaration!$D21/$G$18","v":{"$error":"#DIV/0!"}},null,"Abfallimport aus Ausland","[kg/ t Abfall]","Durchschnittliche Distanz [km]"]
[{"$f":"Umweltdeklaration!$B22","v":"Sekundärzink, kg"},null,{"$error":"#DIV/0!"},{"$f":"Umweltdeklaration!$D22/$G$18","v":{"$error":"#DIV/0!"}},null,"Importierte Menge per Bahn",{"$f":"Ergebnis!G24/Ergebnis!$G$18*1000","v":{"$error":"#DIV/0!"}},{"$f":"Eingabe!D18","v":0}]
[{"$f":"Umweltdeklaration!$B23","v":"Sekundär-Zinkkonzentrat, kg"},null,{"$error":"#DIV/0!"},{"$f":"Umweltdeklaration!$D23/$G$18","v":{"$error":"#DIV/0!"}},null,"Importierte Menge per LKW",{"$f":"Ergebnis!G25/Ergebnis!$G$18*1000","v":{"$error":"#DIV/0!"}},{"$f":"Eingabe!D19","v":0}]
[{"$f":"Umweltdeklaration!$B24","v":"Sekundär-Bleikonzentrat, kg"},null,{"$error":"#DIV/0!"},{"$f":"Umweltdeklaration!$D24/$G$18","v":{"$error":"#DIV/0!"}}]
["TOTAL",{"$f":"SUM(B4:B11)","v":{"$error":"#DIV/0!"}},{"$f":"SUM(C12:C26)","v":{"$error":"#DIV/0!"}},{"$f":"SUM(D12:D26)","v":{"$error":"#DIV/0!"}},null,"Hilfsstoffe Total","[Menge/ t Abfall]","Konzentration"]
[{"$nulls":5},"Natronlauge",{"$f":"Ergebnis!G28/Ergebnis!$G$18*1000","v":{"$error":"#DIV/0!"}},{"$f":"Eingabe!D22","v":0}]
[{"$nulls":5},"NaHCO3 / Natriumbicarbonat / Natron",{"$f":"Ergebnis!G29/Ergebnis!$G$18*1000","v":{"$error":"#DIV/0!"}},{"$f":"Eingabe!D23","v":0}]
[{"$nulls":5},"Ammoniak",{"$f":"Ergebnis!G30/Ergebnis!$G$18*1000","v":{"$error":"#DIV/0!"}},{"$f":"Eingabe!D24","v":0}]
[{"$nulls":5},"Salzsäure",{"$f":"Ergebnis!G31/Ergebnis!$G$18*1000","v":{"$error":"#DIV/0!"}},{"$f":"Eingabe!D25","v":0}]
[{"$nulls":5},"FeCl3",{"$f":"Ergebnis!G32/Ergebnis!$G$18*1000","v":{"$error":"#DIV/0!"}},{"$f":"Eingabe!D26","v":0}]
[{"$nulls":5},"CaO",{"$f":"Ergebnis!G33/Ergebnis!$G$18*1000","v":{"$error":"#DIV/0!"}}]
[{"$nulls":5},"Kalkhydrat Ca(OH)2",{"$f":"Ergebnis!G34/Ergebnis!$G$18*1000","v":{"$error":"#DIV/0!"}}]
[{"$nulls":5},"Salzsole, gesättigt",{"$f":"Ergebnis!G35/Ergebnis!$G$18*1000","v":{"$error":"#DIV/0!"}}]
[{"$nulls":5},"Adsorbensmittel (Herdofenkoks)",{"$f":"Ergebnis!G36/Ergebnis!$G$18*1000","v":{"$error":"#DIV/0!"}}]
[{"$nulls":5},"Andere Chemikalien (organisch; zB. TMT)",{"$f":"Ergebnis!G37/Ergebnis!$G$18*1000","v":{"$error":"#DIV/0!"}},{"$f":"Eingabe!D31","v":0}]
[{"$nulls":5},"Andere Chemikalien (anorganisch)",{"$f":"Ergebnis!G38/Ergebnis!$G$18*1000","v":{"$error":"#DIV/0!"}},{"$f":"Eingabe!D32","v":0}]
[{"$nulls":5},"Wasser",{"$f":"Ergebnis!G39/Ergebnis!$G$18","v":{"$error":"#DIV/0!"}}]
[{"$nulls":5},"Strombezug aus Netz",{"$f":"Ergebnis!G40/Ergebnis!$G$18*1000","v":{"$error":"#DIV/0!"}}]
[{"$nulls":5},"Propangas Bezug",{"$f":"Ergebnis!G41/Ergebnis!$G$18*1000","v":{"$error":"#DIV/0!"}}]
[{"$nulls":5},"Erdgas Bezug",{"$f":"Ergebnis!G42/Ergebnis!$G$18","v":{"$error":"#DIV/0!"}}]
[{"$nulls":5},"Heizöl Bezug",{"$f":"Ergebnis!G43/Ergebnis!$G$18","v":{"$error":"#DIV/0!"}}]
[]
[{"$nulls":5},"Emissionen in Luft","[g/ t Abfall]"]
[{"$nulls":5},"Partikel (PM)",{"$f":"Ergebnis!G46/Ergebnis!$G$18*1000","v":{"$error":"#DIV/0!"}}]
[{"$nulls":5},"Schwefeldioxid (SO2)",{"$f":"Ergebnis!G47/Ergebnis!$G$18*1000","v":{"$error":"#DIV/0!"}}]
[{"$nulls":5},"Stickoxide (NOx)",{"$f":"Ergebnis!G48/Ergebnis!$G$18*1000","v":{"$error":"#DIV/0!"}}]
[{"$nulls":5},"Ammoniak (NH3)",{"$f":"Ergebnis!G49/Ergebnis!$G$18*1000","v":{"$error":"#DIV/0!"}}]
[{"$nulls":5},"Zink (Zn)",{"$f":"Ergebnis!G50/Ergebnis!$G$18*1000","v":{"$error":"#DIV/0!"}}]
[]
[{"$nulls":5},"Energierückgewinnung","[kWh/ t Abfall]"]
[{"$nulls":5},"Strom Verkaufsmenge (inkl. Regelleistung)",{"$f":"Ergebnis!G53/Ergebnis!$G$18*1000","v":{"$error":"#DIV/0!"}}]
[{"$nulls":5},"Wärme/Dampf Verkaufsmenge",{"$f":"Ergebnis!G54/Ergebnis!$G$18*1000","v":{"$error":"#DIV/0!"}}]
[]
[{"$nulls":5},"Metallrückgewinnung aus Schlacke","[kg/ t Abfall]"]
[{"$nulls":5},"Eisen",{"$f":"Ergebnis!G57/Ergebnis!$G$18*1000","v":{"$error":"#DIV/0!"}}]
[{"$nulls":5},"Kupfer",{"$f":"Ergebnis!G58/Ergebnis!$G$18*1000","v":{"$error":"#DIV/0!"}},null,"intern"]
[{"$nulls":5},"Aluminium",{"$f":"Ergebnis!G59/Ergebnis!$G$18*1000","v":{"$error":"#DIV/0!"}}]
[{"$nulls":5},"Edelstahl",{"$f":"Ergebnis!G60/Ergebnis!$G$18*1000","v":{"$error":"#DIV/0!"}}]
[{"$nulls":5},"Gold",{"$f":"Ergebnis!G61/Ergebnis!$G$18*1000","v":{"$error":"#DIV/0!"}},null,"extern"]
[{"$nulls":5},"Nichteisenmetalle (Total an Kupfer und Aluminium)",{"$f":"Ergebnis!G62/Ergebnis!$G$18*1000","v":{"$error":"#DIV/0!"}}]
[{"$nulls":5},"Eisenmetalle (Total an Eisen und Edelstahl)",{"$f":"Ergebnis!G63/Ergebnis!$G$18*1000","v":{"$error":"#DIV/0!"}}]
[]
[{"$nulls":5},"Behandlung der Flugasche","Anteil Flugasche"]
[{"$nulls":5},"FLUWA",{"$f":"Eingabe!C60","v":0},{"$f":"IF(Eingabe!E60=1,'Ergebnis pro Tonne'!I58,I61)","v":"intern"}]
[{"$nulls":5},"FLUREC (extern)",{"$f":"Eingabe!C61","v":0}]
[{"$nulls":5},"Unbehandelt auf Reststoffdeponie (Verfestigung mit Zement) ",{"$f":"Eingabe!C62","v":0}]
[{"$nulls":5},"Unbehandelt auf Untertagedeponie ",{"$f":"Eingabe!C63","v":0}]
[{"$nulls":5},"Total",{"$f":"SUM(G66:G69)","v":0}]
[]
[{"$nulls":5},"Deponierung von Gewebefilter Rückständen","[kg/ t Abfall]"]
[{"$nulls":5},"Untertagedeponie",{"$f":"Ergebnis!G73/Ergebnis!$G$18*1000","v":{"$error":"#DIV/0!"}}]