{"text_format":"2","workbook":"xlsx","n_sheets":7,"sheets":["Info","Prüfung","Umweltdeklaration","LRV","menues","LCIA","Prüfwert"],"not_rendered":{"charts":1,"images":2,"macros":0,"external_links":0,"defined_names":64,"comments":2,"pivot_tables":0},"unopened":[],"bounds":{"document_bytes":16777216,"sheet_cells":100000,"run_cost":"one","rows_first":2000,"rows_last":500,"rows_between":2000,"halvings":0,"cell_chars":16384,"cell_head_chars":4096},"cells_cut":0,"cells_raw":0,"read":"whole","date_system":"1900"}

{"sheet":"Info","index":0,"n_rows":56,"n_cols":2,"rows_kept":56,"cut":false,"hidden":false,"merged":[]}
[]
[{"$f":"Prüfung!B2","v":"naturemade Star Prüfung: Energieprodukte aus Holzenergieanlagen"}]
["Kenngrössenmodell erstellt durch Niels Jungbluth, ESU-services GmbH"]
[]
["Anleitung"]
["Alle weissen Felder im Blatt „Prüfung“ müssen ausgefüllt werden. Bei Eingabe einer Null erscheint die für die Eingabe geforderte Einheit. Bestehende Formeln in weissen Zellen können mit direkten Eingaben oder eigenen Formeln ersetzt werden. Farbige Zellen dürfen nicht verändert werden. Aus den Drop-Down Menüs müssen die passenden Anlagenspezifikationen ausgewählt werden."]
["Die automatische Berechnung in Excel muss eingeschaltet sein (/Extras/Optionen/Berechnung --> automatisch) oder man kann mit [F9] Taste jeweils neu berechnen lassen."]
["Alle Angaben müssen für einen einheitlich Zeitraum (in der Regel ein Jahr) eingegeben werden."]
["In der Spalte \"Prüfungen\" im Blatt Prüfungen werden spezielle Aspekte der Eingabe kontrolliert. Durch anklicken eines Kästchens wird im Kommentarfeld die Frage der Prüfung angegeben."]
["ORC - Organic Ranking Cycle"]
["Die Berechnungen für Holzvergasungsanlagen beruhen auf Planungswerten. Somit ist nur eine vorläufige Zertifizierung möglich. Das Modell muss noch mit tatsächlichen Betriebsdaten aufdatiert werden, sobald diese zur Verfügung stehen."]
[]
["Default Werte für die Eingabe der relativen Feuchte im Blatt Prüfung, Spalte D"]
["Für die Angabe der relativen Feuchte (W) sollen nach Möglichkeit gemessene Werte eingesetzt werden. Stehen diese nicht zur Verfügung, so können folgende Standardwerte verwendet werden.","relative Feuchte (W)"]
["Holzschnitzel, Frischholz (Laubbaum)",{"$f":"TRANSPOSE(LCIA!C15:G15)","v":0.44444444444444442}]
["Holzschnitzel, Frischholz (Nadelbaum)",0.58333333333333337]
["Holzschnitzel, Restholz (z.B. aus Sägerei)",0.2857142857142857]
["Holzpellets",9.0909090909090981E-2]
["Holzschnitzel, Altholz",0.2857142857142857]
["Falls nur bekannt ist, ob es sich um \"grüne\", \"halbgrüne\" oder \"trockene\" Schnitzel handelt, können auch folgende Werte verwendet werden. Bitte schätzen Sie dann ab, zu welchen Anteilen es sich um Laub-, Nadel- oder Restholz handelt und tragen diese in die entsprechenden Zeilen ein."]
["Schnitzel grün",0.5]
["Schnitzel halbgrün",0.3]
["Schnitzel trocken",0.2]
[]
["Systemgrenzen"]
["Für die Berechnung des Energieeigenverbrauchs und für die Grenzen der Ökobilanzierung sind die Systemgrenzen gemäss Hintergrundbericht zu beachten. Grundsätzlich erfolgen die Eingaben aus Sicht des Anlagenbetreibers und seinem wirtschaftlichen Entscheidungsbereich. Bei den Transporten müssen alle Transporte von der Schnitzelherstellung bis zur Anlage berücksichtigt werden. Bei Importen per Schiff bzw. Bahn müssen auch Lkw Transporte im Herkunftsland mit erfasst werden."]
[]
["Umweltdeklaration"]
["Die Umweltdeklaration weisst die Umweltbelastungen grob aus. Unterschiede bei Vergleichen von weniger als 10% sind in der Regel nicht relevant."]
[]
["Rückfragen"]
["Bei Fragen zum Modell sollte zunächst der vollständige Hintergrundbericht angeschaut werden. Jungbluth N. (2019) Handbuch für die naturemade Kennwertmodelle: Ökobilanzen für die Prüfung des globalen Kriteriums. ESU-services im Auftrag vom Verein für umweltgerechte Energie (VUE), Schaffhausen."]
["http://www.esu-services.ch/projects/naturemade/"]
["Für Fragen und Rückmeldungen ist die naturemade Geschäftsstelle zuständig. Bitte schicken Sie hierzu die ausgefüllte Excel-Tabelle, abgespeichert unter neuem Namen unter Beibehaltung der Versionennummer an folgende Adresse:"]
[]
["Verein für umweltgerechte Energie (VUE), naturemade Geschäftsstelle"]
["Molkenstrasse 21"]
["8004 Zürich"]
["T: +41 44 213 10 21"]
["www.naturemade.ch"]
["valentin.graf@naturemade.ch"]
[]
["Entwicklung und Auftragnehmer"]
["© ESU-services GmbH, Version 2021-4.3"]
["Vorstadt 14"]
["CH-8200 Schaffhausen"]
["T. +41 44 940 61 32"]
["jungbluth@esu-services.ch"]
["http://www.esu-services.ch/projects/naturemade/"]
[]
["Version zuletzt überarbeitet im September 2020 durch nj"]
["Eco-indicator v2.10 und ecoinvent ESU-database 2019"]
[]
["13.1.2021 - Korrektur Übersetzung"]
["24.9.2020 - Korrektur der Formel für Wirkungsgrad Überprüfung I39"]
["30.10.2019 - Neuberechnung der Ökobilanzhintergrunddaten für alle 4 Indikatoren"]

{"sheet":"Prüfung","index":1,"n_rows":44,"n_cols":15,"rows_kept":44,"cut":false,"hidden":false,"merged":[]}
[null,null,41,42,null,44,72,73]
[2,{"$f":"INDEX(menues!$1:$1048576,$A2,sprache)","v":"naturemade Star Prüfung: Energieprodukte aus Holzenergieanlagen"},{"$nulls":6},"Prüfungen"]
[3,{"$f":"INDEX(menues!$1:$1048576,$A3,sprache)","v":"Eingabe:"},{"$nulls":6},"",1]
[4,{"$f":"INDEX(menues!$1:$1048576,$A4,sprache)","v":"Anlagenname und Referenzzeitraum"},"Beispielanlage",{"$nulls":5},""]
[6,{"$f":"INDEX(menues!$1:$1048576,$A5,sprache)","v":"Anlagentyp"},{"$nulls":6},{"$f":"NOT(AND(Anlagentyp=1,C32>0))","v":true},2]
[7,{"$f":"INDEX(menues!$1:$1048576,$A6,sprache)","v":"Inputs"},{"$f":"INDEX(menues!$1:$1048576,$C1,sprache)","v":"Schütt-kubikmeter"},{"$f":"INDEX(menues!$1:$1048576,D1,sprache)","v":"relative Feuchte (W)"},"atro",{"$f":"INDEX(menues!$1:$1048576,$F1,sprache)","v":"Mittlere einfache Transportentfernung, Lkw"},{"$f":"INDEX(menues!$1:$1048576,$G1,sprache)","v":"Mittlere einfache Transportentfernung, Bahn"},{"$f":"INDEX(menues!$1:$1048576,$H1,sprache)","v":"Mittlere einfache Transportentfernung, Schiff"},""]
[75,{"$f":"INDEX(menues!$1:$1048576,$A7,sprache)","v":"Holzschnitzel, Laubbaum"},0,0.45,{"$f":"TRANSPOSE(LCIA!C17:G17)","v":0},0,0,0,""]
[76,{"$f":"INDEX(menues!$1:$1048576,$A8,sprache)","v":"Holzschnitzel, Nadelbaum"},0,0.45,0,0,0,0,"",{"$nulls":4},{"$f":"name","v":"Beispielanlage"},{"$f":"Umweltdeklaration!B11","v":"Prüfwert"}]
[77,{"$f":"INDEX(menues!$1:$1048576,$A9,sprache)","v":"Holzschnitzel, Restholz (z.B. aus Sägerei)"},0,0.2857142857142857,0,0,0,0,"",null,null,null,{"$f":"Umweltdeklaration!B4","v":"eingekaufte Substrate"},{"$f":"Umweltdeklaration!H4","v":0}]
[74,{"$f":"INDEX(menues!$1:$1048576,$A10,sprache)","v":"Holzpellets"},0,9.0909090909090981E-2,0,0,0,0,"",null,null,null,{"$f":"Umweltdeklaration!B5","v":"Fremdenergiebedarf"},{"$f":"Umweltdeklaration!H5","v":0}]
[78,{"$f":"INDEX(menues!$1:$1048576,$A11,sprache)","v":"Holzschnitzel, Altholz"},0,0.2857142857142857,0,0,0,0,"",null,null,null,{"$f":"Umweltdeklaration!B5","v":"Fremdenergiebedarf"},{"$f":"Umweltdeklaration!H5","v":0}]
[80,{"$f":"INDEX(menues!$1:$1048576,$A12,sprache)","v":"Holzmenge"},{"$f":"SUM(C7:C11)","v":0},null,{"$f":"SUM(E7:E11)","v":0},null,null,null,"",{"$f":"C11>0","v":false},null,null,{"$f":"Umweltdeklaration!B6","v":"Transporte"},{"$f":"Umweltdeklaration!H6","v":0}]
[23,{"$f":"INDEX(menues!$1:$1048576,$A13,sprache)","v":"Rapsölmethylester"},0,null,{"$f":"C13","v":0},0,0,0,""]
[21,{"$f":"INDEX(menues!$1:$1048576,$A14,sprache)","v":"Gesamtinputmenge für Anlage"},{"$f":"SUM(LCIA!C19:H19)","v":0},{"$f":"C14/SUM(LCIA!C18:G18)","v":{"$error":"#DIV/0!"}},{"$f":"C14/C12","v":{"$error":"#DIV/0!"}},{"$f":"LCIA!M6","v":0},{"$f":"LCIA!N6","v":0},{"$f":"LCIA!O6","v":0},{"$f":"C14>0","v":false},null,null,null,{"$f":"Umweltdeklaration!B7","v":"Verbrennung, Verteilung"},{"$f":"Umweltdeklaration!H7","v":0}]
[93,{"$f":"INDEX(menues!$1:$1048576,$A15,sprache)","v":"Energiebezug der Anlage (Systemgrenzen beachten)"},{"$f":"SUM(C16:C19)","v":0},{"$nulls":5},"",null,null,null,{"$f":"Umweltdeklaration!B8","v":"Aschen zur Entsorgung"},{"$f":"Umweltdeklaration!H8","v":0}]
[9,{"$f":"INDEX(menues!$1:$1048576,$A16,sprache)","v":"Strombezug aus Netz"},0,{"$nulls":5},{"$f":"IF(AND(C34>0,C16>0),FALSE,TRUE)","v":true},null,null,null,{"$f":"Umweltdeklaration!B13","v":"Grenzwert Strom"},null,{"$f":"Umweltdeklaration!D13","v":0}]
[10,{"$f":"INDEX(menues!$1:$1048576,$A17,sprache)","v":"Heizölverbrauch"},0,{"$nulls":5},"",null,null,null,{"$f":"Umweltdeklaration!B14","v":"Grenzwert Wärme"},null,{"$f":"Umweltdeklaration!D14","v":0}]
[87,{"$f":"INDEX(menues!$1:$1048576,$A18,sprache)","v":"Dieselverbrauch (10 kWh/Liter)"},0,{"$nulls":5},"",null,null,null,{"$f":"Umweltdeklaration!B15","v":"Grenzwert Methan"},null,{"$f":"Umweltdeklaration!D15","v":0}]
[18,{"$f":"INDEX(menues!$1:$1048576,$A19,sprache)","v":"Erdgasverbrauch"},0,{"$nulls":5},"",{"$nulls":4},{"$f":"SUM(N9:N18)","v":0},{"$f":"SUM(O9:O18)","v":0}]
[28,{"$f":"INDEX(menues!$1:$1048576,$A20,sprache)","v":"Luftemissionen im trockn. Abgas bez. auf 11%/13% O2 / Feuerungswärmeleistung"},null,null,{"$f":"Nm3_Abgas","v":0},null,null,null,{"$f":"Anlagengrösse>1","v":true},4]
[81,{"$f":"INDEX(menues!$1:$1048576,$A21,sprache)","v":"Stickoxide NOx als NO2 / Emissionsgrenzwerte gemäss LRV"},250,null,{"$f":"OFFSET(LRV!$A$1,2,Anlagengrösse+1)","v":250},null,null,null,{"$f":"AND(0<C21,C21<=E21)","v":true}]
[82,{"$f":"INDEX(menues!$1:$1048576,$A22,sprache)","v":"Staub (= Feststoffe), PM10 / Emissionsgrenzwerte gemäss LRV"},20,null,{"$f":"OFFSET(LRV!$A$1,3,Anlagengrösse+1)","v":20},null,null,null,{"$f":"AND(0<C22,C22<=E22)","v":true}]
[83,{"$f":"IF(altholzverbrennung,INDEX(menues!$1:$1048576,$A23,sprache),\"-\")","v":"-"},0,null,{"$f":"IF(altholzverbrennung,J23,\"-\")","v":"-"},null,null,null,{"$f":"IF(altholzverbrennung,AND(0<C23,C23<=E23),TRUE)","v":true},1]
[84,{"$f":"IF(altholzverbrennung,INDEX(menues!$1:$1048576,$A24,sprache),\"-\")","v":"-"},0,null,{"$f":"IF(altholzverbrennung,J24,\"-\")","v":"-"},null,null,null,{"$f":"IF(altholzverbrennung,AND(0<C24,C24<=E24),TRUE)","v":true},0.1]
[85,{"$f":"IF(altholzverbrennung,INDEX(menues!$1:$1048576,$A25,sprache),\"-\")","v":"-"},0,null,{"$f":"IF(altholzverbrennung,J25,\"-\")","v":"-"},null,null,null,{"$f":"IF(altholzverbrennung,AND(0<C25,C25<=E25),TRUE)","v":true},1]
[11,{"$f":"INDEX(menues!$1:$1048576,$A26,sprache)","v":"Outputs der Anlage"},{"$nulls":6},""]
[12,{"$f":"INDEX(menues!$1:$1048576,$A27,sprache)","v":"Gesamtproduktion Biomethan, Brutto (12.7 kWh/kg)"},0,{"$nulls":5},""]
[24,{"$f":"INDEX(menues!$1:$1048576,$A28,sprache)","v":"ungewollte Biogas Verluste (Methanschlupf und Unterbrüche)"},0,{"$nulls":5},""]
[16,{"$f":"INDEX(menues!$1:$1048576,$A29,sprache)","v":"Biomethan: Verkauf und Verbrauch ausserhalb der Anlage"},0,null,{"$f":"C29/12.7/1000","v":0},null,null,null,{"$f":"IF(C29>0,IF(Anlagentyp=5,TRUE,FALSE),TRUE)","v":true}]
[13,{"$f":"INDEX(menues!$1:$1048576,$A30,sprache)","v":"Biomethan verbrannt in Fackel, Heizung, BHKW"},{"$f":"C27-C28-C29","v":0},{"$nulls":5},""]
[55,{"$f":"INDEX(menues!$1:$1048576,$A31,sprache)","v":"Total Biomethannutzung, Brutto"},{"$f":"C30+C28+C29","v":0},{"$nulls":5},{"$f":"C31<=C27","v":true}]
[99,{"$f":"INDEX(menues!$1:$1048576,$A32,sprache)","v":"Gesamtproduktion Strom, Brutto"},0,{"$nulls":5},""]
[100,{"$f":"INDEX(menues!$1:$1048576,$A33,sprache)","v":"Eigenverbrauch der Anlage"},0,{"$nulls":5},""]
[14,{"$f":"INDEX(menues!$1:$1048576,$A34,sprache)","v":"Strom: Verkauf und Verbrauch ausserhalb der Anlage"},0,null,{"$f":"C34/$C$14","v":{"$error":"#DIV/0!"}},null,null,null,{"$f":"C34<=(C32-C33)","v":true}]
[32,{"$f":"INDEX(menues!$1:$1048576,$A35,sprache)","v":"Einspeisung Wärmeverbund / Verteilverluste"},0,0.20300000000000001,{"$f":"C35/C14","v":{"$error":"#DIV/0!"}},null,null,null,{"$f":"D35<J35","v":false},0.2]
[43,{"$f":"INDEX(menues!$1:$1048576,$A36,sprache)","v":"Nahwärmenutzung: Verkauf, Verbrauch im Gebäudekomplex"},0,{"$nulls":5},{"$f":"SUM(C34:C36,C29)<C14","v":false}]
[62,{"$f":"INDEX(menues!$1:$1048576,$A37,sprache)","v":"Total Wärmeverkauf (nach Abzug Verteilverluste)"},{"$f":"C36+C35*(1-D35)","v":0},null,{"$f":"C37/C14","v":{"$error":"#DIV/0!"}},null,null,null,""]
[102,{"$f":"INDEX(menues!$1:$1048576,$A38,sprache)","v":"Gesamtmenge Energieprodukte"},{"$f":"C37+C29+C34","v":0},{"$nulls":5},{"$f":"C39<1","v":{"$error":"#DIV/0!"}}]
[40,{"$f":"INDEX(menues!$1:$1048576,$A39,sprache)","v":"energetischer Wirkungsgrad"},{"$f":"C38/C14","v":{"$error":"#DIV/0!"}},{"$nulls":5},{"$f":"E37>=WärmeMax-(WärmeMax-WärmeMin)/StromMax*E34","v":{"$error":"#DIV/0!"}},{"$f":"IF(Anlagentyp=1,75%,60%)","v":0.6}]
[30,{"$f":"INDEX(menues!$1:$1048576,$A40,sprache)","v":"Einfache Distanz Anlage - Ausbringung/Entsorgung"},null,null,null,{"$f":"SUMPRODUCT(D41,F41)","v":0},null,null,""]
[64,{"$f":"INDEX(menues!$1:$1048576,$A41,sprache)","v":"Aschen zur Entsorgung"},null,0,null,100,null,null,"",1]
[15,{"$f":"INDEX(menues!$1:$1048576,$A42,sprache)","v":"Resultate:"},{"$f":"C4","v":"Beispielanlage"},{"$f":"Umweltdeklaration!B11","v":"Prüfwert"},{"$nulls":4},""]
[29,{"$f":"INDEX(menues!$1:$1048576,$A43,sprache)","v":"EI'99-aggregated, Hierarchist"},{"$f":"Umweltdeklaration!H9","v":0},{"$f":"Umweltdeklaration!D22","v":0},{"$f":"C43/D43","v":{"$error":"#DIV/0!"}},null,null,null,{"$f":"E43<1","v":{"$error":"#DIV/0!"}}]
[null,{"$f":"IF(I44,INDEX(menues!$1:$1048576,26,sprache),INDEX(menues!$1:$1048576,27,sprache))","v":{"$error":"#DIV/0!"}},{"$nulls":6},{"$f":"AND(I3:I43)","v":{"$error":"#DIV/0!"}}]

{"sheet":"Umweltdeklaration","index":2,"n_rows":22,"n_cols":11,"rows_kept":22,"cut":false,"hidden":false,"merged":[]}
[{"$nulls":7},29,35,34,31]
[29,{"$f":"name","v":"Beispielanlage"},null,{"$f":"H2","v":"EI'99-aggregated, Hierarchist"},"Anteil",null,null,{"$f":"INDEX(menues!$1:$1048576,H1,sprache)","v":"EI'99-aggregated, Hierarchist"},{"$f":"INDEX(menues!$1:$1048576,$I1,sprache)","v":"Treibhauseffekt 100a 2013"},{"$f":"INDEX(menues!$1:$1048576,J1,sprache)","v":"Bedarf nichterneuerbarer energetischer Ressourcen"},{"$f":"INDEX(menues!$1:$1048576,K1,sprache)","v":"Umweltbelastungspunkte 2013"}]
[56,null,null,{"$f":"H3","v":"Pkt"},null,null,null,"Pkt","kg CO2-eq","MJ-eq","Pkt"]
[46,{"$f":"INDEX(menues!$1:$1048576,$A4,sprache)","v":"eingekaufte Substrate"},null,null,{"$f":"H4/H$9","v":{"$error":"#DIV/0!"}},null,null,{"$f":"SUM(LCIA!$C$10:$H$10)","v":0},{"$f":"SUM(LCIA!$C$11:$H$11)","v":0},{"$f":"SUM(LCIA!$C$12:$H$12)","v":0},{"$f":"SUM(LCIA!$C$13:$H$13)","v":0}]
[45,{"$f":"INDEX(menues!$1:$1048576,$A5,sprache)","v":"Fremdenergiebedarf"},null,null,{"$error":"#DIV/0!"},null,null,{"$f":"SUM(LCIA!$I$10:$L$10)","v":0},{"$f":"SUM(LCIA!$I$11:$L$11)","v":0},{"$f":"SUM(LCIA!$I$12:$L$12)","v":0},{"$f":"SUM(LCIA!$I$13:$L$13)","v":0}]
[47,{"$f":"INDEX(menues!$1:$1048576,$A6,sprache)","v":"Transporte"},null,null,{"$error":"#DIV/0!"},null,null,{"$f":"SUM(LCIA!$M$10:$P$10)","v":0},{"$f":"SUM(LCIA!$M$11:$P$11)","v":0},{"$f":"SUM(LCIA!$M$12:$P$12)","v":0},{"$f":"SUM(LCIA!$M$13:$P$13)","v":0}]
[48,{"$f":"INDEX(menues!$1:$1048576,$A7,sprache)","v":"Verbrennung, Verteilung"},null,null,{"$error":"#DIV/0!"},null,null,{"$f":"SUM(LCIA!$Q$10:$AD$10)","v":0},{"$f":"SUM(LCIA!$Q$11:$AD$11)","v":0},{"$f":"SUM(LCIA!$Q$12:$AD$12)","v":0},{"$f":"SUM(LCIA!$Q$13:$AD$13)","v":0}]
[64,{"$f":"INDEX(menues!$1:$1048576,$A8,sprache)","v":"Aschen zur Entsorgung"},null,null,{"$error":"#DIV/0!"},null,null,{"$f":"SUM(LCIA!$AE$10:$AI$10)","v":0},{"$f":"SUM(LCIA!$AE$11:$AI$11)","v":0},{"$f":"SUM(LCIA!$AE$12:$AI$12)","v":0},{"$f":"SUM(LCIA!$AE$13:$AI$13)","v":0}]
[17,{"$f":"INDEX(menues!$1:$1048576,$A9,sprache)","v":"Total"},null,null,{"$error":"#DIV/0!"},null,null,{"$f":"SUM(H4:H8)","v":0},{"$f":"SUM(I4:I8)","v":0},{"$f":"SUM(J4:J8)","v":0},{"$f":"SUM(K4:K8)","v":0}]
[49]
[56,{"$f":"INDEX(menues!$1:$1048576,$A11,sprache)","v":"Prüfwert"},{"$f":"B9","v":"Total"},null,null,null,{"$f":"name","v":"Beispielanlage"},null,null,null,{"$f":"INDEX(menues!$1:$1048576,$A10,sprache)","v":"Umweltdeklaration"}]
[null,null,"a",{"$nulls":4},{"$f":"H3","v":"Pkt"},{"$f":"I3","v":"kg CO2-eq"},{"$f":"J3","v":"MJ-eq"},{"$f":"K3","v":"Pkt"}]
[51,{"$f":"INDEX(menues!$1:$1048576,$A13,sprache)","v":"Grenzwert Strom"},{"$f":"INDEX(Prüfwert!$1:$1048576,8,MATCH($A13,Prüfwert!$1:$1,0))","v":0},{"$f":"INDEX(Prüfwert!$1:$1048576,10,MATCH($A13,Prüfwert!$1:$1,0))","v":0},{"$f":"D13/D$22","v":{"$error":"#DIV/0!"}},null,{"$f":"REPLACE(B13,1,10,\"\")&\", kWh\"","v":"Strom, kWh"},{"$f":"IF($C13>0,$E13*H$9/$C13,0)","v":0},0,0,0]
[52,{"$f":"INDEX(menues!$1:$1048576,$A14,sprache)","v":"Grenzwert Wärme"},{"$f":"INDEX(Prüfwert!$1:$1048576,8,MATCH($A14,Prüfwert!$1:$1,0))","v":0},{"$f":"INDEX(Prüfwert!$1:$1048576,10,MATCH($A14,Prüfwert!$1:$1,0))","v":0},{"$error":"#DIV/0!"},null,{"$f":"REPLACE(B14,1,10,\"\")&\", kWh\"","v":"Wärme, kWh"},0,0,0,{"$f":"IF($C14>0,$E14*K$9/$C14,0)","v":0}]
[53,{"$f":"INDEX(menues!$1:$1048576,$A15,sprache)","v":"Grenzwert Methan"},{"$f":"INDEX(Prüfwert!$1:$1048576,8,MATCH($A15,Prüfwert!$1:$1,0))","v":0},{"$f":"INDEX(Prüfwert!$1:$1048576,10,MATCH($A15,Prüfwert!$1:$1,0))","v":0},{"$error":"#DIV/0!"},null,{"$f":"REPLACE(B15,1,10,\"\")&\", kWh\"","v":"Methan, kWh"},0,0,0,0]
[54,{"$f":"INDEX(menues!$1:$1048576,$A16,sprache)","v":"Referenz Entsorgung"},{"$f":"INDEX(Prüfwert!$1:$1048576,8,MATCH($A16,Prüfwert!$1:$1,0))","v":0},{"$f":"INDEX(Prüfwert!$1:$1048576,10,MATCH($A16,Prüfwert!$1:$1,0))","v":0},{"$error":"#DIV/0!"}]
[88,{"$f":"INDEX(menues!$1:$1048576,$A17,sprache)","v":"Referenz Güllelager"},{"$f":"INDEX(Prüfwert!$1:$1048576,4,MATCH($A17,Prüfwert!$1:$1,0))","v":0},{"$f":"INDEX(Prüfwert!$1:$1048576,10,MATCH($A17,Prüfwert!$1:$1,0))","v":0},{"$error":"#DIV/0!"}]
[89,{"$f":"INDEX(menues!$1:$1048576,$A18,sprache)","v":"Referenz Kompost"},{"$f":"INDEX(Prüfwert!$1:$1048576,8,MATCH($A18,Prüfwert!$1:$1,0))","v":0},{"$f":"INDEX(Prüfwert!$1:$1048576,10,MATCH($A18,Prüfwert!$1:$1,0))","v":0},{"$error":"#DIV/0!"}]
[90,{"$f":"INDEX(menues!$1:$1048576,$A19,sprache)","v":"Referenz Frischklärschlamm"},{"$f":"INDEX(Prüfwert!$1:$1048576,5,MATCH($A19,Prüfwert!$1:$1,0))","v":0},{"$f":"INDEX(Prüfwert!$1:$1048576,10,MATCH($A19,Prüfwert!$1:$1,0))","v":0},{"$error":"#DIV/0!"}]
[101,{"$f":"INDEX(menues!$1:$1048576,$A20,sprache)","v":0},{"$f":"INDEX(Prüfwert!$1:$1048576,5,MATCH($A20,Prüfwert!$1:$1,0))","v":0},{"$f":"INDEX(Prüfwert!$1:$1048576,10,MATCH($A20,Prüfwert!$1:$1,0))","v":0},{"$error":"#DIV/0!"}]
[63,{"$f":"INDEX(menues!$1:$1048576,$A21,sprache)","v":"Referenz direkte Emissionen"},null,{"$f":"INDEX(Prüfwert!$1:$1048576,10,MATCH($A21,Prüfwert!$1:$1,0))","v":0},{"$error":"#DIV/0!"}]
[17,{"$f":"INDEX(menues!$1:$1048576,$A22,sprache)","v":"Total"},null,{"$f":"SUM(D13:D21)","v":0},{"$error":"#DIV/0!"}]

{"sheet":"LRV","index":3,"n_rows":22,"n_cols":14,"rows_kept":22,"cut":false,"hidden":false,"merged":[]}
[null,null,"bis 70 kW","70 kW bis 500 kW","500 kW bis 1 MW","1 MW bis 10 MW","über 10 MW"]
["Sauerstoffgehalt im Abgas","%vol","    13","    13","  13","  11","  11"]
["Stickoxide (NOx)","mg/m3",250,250,250,250,150]
["Feststoffe insgesamt (Staub)","mg/m3","      –",150,20,20,10]
["      ab 1. Januar 2012","mg/m3","      –",50,20,20,10]
["Kohlenmonoxid (CO)","mg/m3",1000,1000,500,250,150]
["      ab 1. Januar 2012","mg/m3",1000,500,500,250,150]
["gasförmige organische Stoffe, angegeben als Gesamtkohlenstoff (C)","mg/m3","      –","      –","    –","    –",50]
["Ammoniak und Ammoniumverbindungen, angegeben als Ammoniak","mg/m3","      –","      –","    –",30,30]
[]
[]
[]
[{"$nulls":8},"Strom","Wärme","Total","Total berechnet","Prüfung","Wärme Min"]
[{"$nulls":8},0,0.75,{"$f":"SUM(I14:J14)","v":0.75},{"$f":"WärmeMax-(WärmeMax-WärmeMin)/StromMax*I14+I14","v":0.75},{"$f":"WärmeMax>=WärmeMax-(WärmeMax-WärmeMin)/StromMax*I14","v":true},{"$f":"WärmeMax-(WärmeMax-WärmeMin)/StromMax*I14","v":0.75}]
[{"$nulls":8},0.1,{"$f":"$J$14-($J$14-$J$18)/$I$18*I15","v":0.61250000000000004},{"$f":"SUM(I15:J15)","v":0.71250000000000002},{"$f":"WärmeMax-(WärmeMax-WärmeMin)/StromMax*I15+I15","v":0.71250000000000002},{"$f":"WärmeMax>=WärmeMax-(WärmeMax-WärmeMin)/StromMax*I15","v":true},{"$f":"WärmeMax-(WärmeMax-WärmeMin)/StromMax*I15","v":0.61250000000000004}]
[{"$nulls":8},0.2,{"$f":"$J$14-($J$14-$J$18)/$I$18*I16","v":0.47499999999999998},0.67500000000000004,{"$f":"WärmeMax-(WärmeMax-WärmeMin)/StromMax*I16+I16","v":0.67500000000000004},{"$f":"WärmeMax>=WärmeMax-(WärmeMax-WärmeMin)/StromMax*I16","v":true},{"$f":"WärmeMax-(WärmeMax-WärmeMin)/StromMax*I16","v":0.47499999999999998}]
[{"$nulls":8},0.3,0.33750000000000002,0.63749999999999996,{"$f":"WärmeMax-(WärmeMax-WärmeMin)/StromMax*I17+I17","v":0.63749999999999996},{"$f":"WärmeMax>=WärmeMax-(WärmeMax-WärmeMin)/StromMax*I17","v":true},{"$f":"WärmeMax-(WärmeMax-WärmeMin)/StromMax*I17","v":0.33750000000000002}]
[{"$nulls":8},0.4,0.2,{"$f":"SUM(I18:J18)","v":0.60000000000000009},{"$f":"WärmeMax-(WärmeMax-WärmeMin)/StromMax*I18+I18","v":0.6},{"$f":"WärmeMax>=WärmeMax-(WärmeMax-WärmeMin)/StromMax*I18","v":true},{"$f":"WärmeMax-(WärmeMax-WärmeMin)/StromMax*I18","v":0.19999999999999996}]
[]
[]
[{"$nulls":8},0,{"$f":"$J$14-($J$14-$J$18)/$I$18*I21","v":0.75},{"$f":"SUM(I21:J21)","v":0.75},{"$f":"WärmeMax-(WärmeMax-WärmeMin)/StromMax*I21+I21","v":0.75}]
[{"$nulls":8},0.4,0.19999999999999996,{"$f":"SUM(I22:J22)","v":0.6},{"$f":"WärmeMax-(WärmeMax-WärmeMin)/StromMax*I22+I22","v":0.6}]

{"sheet":"menues","index":4,"n_rows":103,"n_cols":6,"rows_kept":103,"cut":false,"hidden":true,"merged":[]}
["Deutsch","Français","English","Italian",null,"Text"]
["naturemade Star Prüfung: Energieprodukte aus Holzenergieanlagen","Contrôle éco-électricité: produits d'énergie des installations de bois énergie",null,null,2,"Deutsch"]
["Eingabe:","Entrée:",null,null,3,"Français"]
["Anlagenname und Referenzzeitraum","Nom de l'installation et période de référence:",null,null,4]
["Menge","Quantité",null,null,5]
["Anlagentyp","Type d'installation",null,null,6]
["Inputs","Inputs",null,null,7]
["Substrate","Substrats pour l'installation",null,null,8]
["Strombezug aus Netz","Consommation d'électricité du réseau",null,null,9]
["Heizölverbrauch","Consommation de mazout",null,null,10]
["Outputs der Anlage","Outputs",null,null,11]
["Gesamtproduktion Biomethan, Brutto (12.7 kWh/kg)","Production totale de biogaz, brut (12.7kWh/kg)",null,null,12]
["Biomethan verbrannt in Fackel, Heizung, BHKW","Biogaz des torchères, chauffage, cogénération",null,null,13]
["Strom: Verkauf und Verbrauch ausserhalb der Anlage","Courant: vente et consommation hors de l'installation",null,null,14]
["Resultate:","Résultats:",null,null,15]
["Biomethan: Verkauf und Verbrauch ausserhalb der Anlage","Biomethane: vente et consommation hors de l'installation",null,null,16]
["Total","Total",null,null,17]
["Erdgasverbrauch","Consommation de gaz naturel",null,null,18]
["naturemade Prüfwert","Valeur-limite naturemade ",null,null,19]
["direkte Emissionen","Émissions directes",null,null,20]
["Gesamtinputmenge für Anlage","Input total de l'installation",null,null,21]
["pro kWh Strom","par kWh de courant",null,null,22]
["Rapsölmethylester","Huile de colza (ester méthylique)",null,null,23]
["ungewollte Biogas Verluste (Methanschlupf und Unterbrüche)","Pertes de biogaz (volatilisation et interruptions)",null,null,24]
["Keine Prüfung möglich","Contrôle impossible",null,null,25]
["Globales naturemade Star Kriterium erfüllt","Critère d'éco-électricité satisfait",null,null,26]
["naturemade Star Kriterium nicht erfüllt","Critère d'éco-électricité non satisfait",null,null,27]
["Luftemissionen im trockn. Abgas bez. auf 11%/13% O2 / Feuerungswärmeleistung","Émissions atmosph. dans le gaz épuré rel. à 11%/13% O2 / puissance calorifique",null,null,28]
["EI'99-aggregated, Hierarchist","EI'99-aggregated, Hierarchist",null,null,29]
["Einfache Distanz Anlage - Ausbringung/Entsorgung","Distance simple installation - épandage/traitement des déchets",null,null,30]
["Umweltbelastungspunkte 2013","Méthode de la saturation écologique 2013",null,null,31]
["Einspeisung Wärmeverbund / Verteilverluste","Alimentation de chauffage à distance / pertes de distribution",null,null,32]
["Bedarf erneuerbarer energetischer Ressourcen","Besoin de ressources énergétiques renouvelables",null,null,33]
["Bedarf nichterneuerbarer energetischer Ressourcen","Besoin de ressources énergétiques non-renouvelables",null,null,34]
["Treibhauseffekt 100a 2013","Effet de serre 100a 2013",null,null,35]
["Frischmasse (FM)","Matière fraîche (MF)",null,null,36]
["Finanzieller Ertrag (plus) bzw. Aufwand (minus), ohne Transportkosten, für die Anlage","Revenus (+) ou Dépenses (-) pour l'installation, sauf frais de transport ",null,null,37]
["Distanz, Anlieferung mit Traktor","Distance simple pour la livraison du co-substrat par tracteur",null,null,38]
["Distanz, Anlieferung mit Lkw","Distance simple pour la livraison du co-substrat par camion",null,null,39]
["energetischer Wirkungsgrad","Degré d'efficacité énergétique",null,null,40]
["Schütt-kubikmeter","Mètre cubes de plaquettes",null,null,41]
["relative Feuchte (W)","Humidité relative",null,null,42]
["Nahwärmenutzung: Verkauf, Verbrauch im Gebäudekomplex","Chaleur à proximité: vente, consomm. dans l'ensemble de bâtiments",null,null,43]
["Mittlere einfache Transportentfernung, Lkw","Distance moyenne de transport, camion",null,null,44]
["Fremdenergiebedarf","Consommation d'énergie additionnelle",null,null,45]
["eingekaufte Substrate","Substrats achetés",null,null,46]
["Transporte","Transports",null,null,47]
["Verbrennung, Verteilung","Combustion, distribution",null,null,48]
["Umweltdeklaration","Déclaration environnementale",null,null,49]
["Infrastruktur","Infrastructure",null,null,50]
["Grenzwert Strom","Valeur-limite courant",null,null,51]
["Grenzwert Wärme","Valeur-limite chaleur",null,null,52]
["Grenzwert Methan","Valeur-limite méthane",null,null,53]
["Referenz Entsorgung","Référence pour le traitement des déchets",null,null,54]
["Total Biomethannutzung, Brutto","Utilisation de biométhane, brut",null,null,55]
["Prüfwert","Valeur de contrôle",null,null,56]
["Holzheizung","Chauffage de bois",null,null,57,{"$f":"INDEX(menues!$1:$1048576,$E57,sprache)","v":"Holzheizung"}]
["WKK Holzverbrennung","CCF bois",null,null,58,{"$f":"INDEX(menues!$1:$1048576,$E58,sprache)","v":"WKK Holzverbrennung"}]
["WKK Holzverbrennung, ORC","CCF bois avec ORC",null,null,59,{"$f":"INDEX(menues!$1:$1048576,$E59,sprache)","v":"WKK Holzverbrennung, ORC"}]
["WKK Holzvergasung, Pyroforce","CCF bois avec pyroforce",null,null,60,{"$f":"INDEX(menues!$1:$1048576,$E60,sprache)","v":"WKK Holzvergasung, Pyroforce"}]
["Holzvergasung, Repotec, Methanisierung","Méthanisation de bois, Repotec, méthanisation",null,null,61,{"$f":"INDEX(menues!$1:$1048576,$E61,sprache)","v":"Holzvergasung, Repotec, Methanisierung"}]
["Total Wärmeverkauf (nach Abzug Verteilverluste)","Vente de chaleur",null,null,62,{"$f":"INDEX(menues!$1:$1048576,$E62,sprache)","v":"Total Wärmeverkauf (nach Abzug Verteilverluste)"}]
["Referenz direkte Emissionen","Référence pour les émissions directes",null,null,63]
["Aschen zur Entsorgung","Cendres à éliminer",null,null,64]
[{"$nulls":4},65,{"$f":"INDEX(menues!$1:$1048576,$E65,sprache)","v":0}]
["Kehrichtverbrennungsanlage","Usine d'incinération des ordures ",null,null,66,{"$f":"INDEX(menues!$1:$1048576,$E66,sprache)","v":"Kehrichtverbrennungsanlage"}]
["Reaktordeponie","Décharge contrôlée pour résidus stabilisés",null,null,67,{"$f":"INDEX(menues!$1:$1048576,$E67,sprache)","v":"Reaktordeponie"}]
["Sondermülldeponie (Untertage)","Décharge souterraine",null,null,68,{"$f":"INDEX(menues!$1:$1048576,$E68,sprache)","v":"Sondermülldeponie (Untertage)"}]
["Düngung in der Landwirtschaft","Fertilisation dans l'agriculture",null,null,69,{"$f":"INDEX(menues!$1:$1048576,$E69,sprache)","v":"Düngung in der Landwirtschaft"}]
[{"$nulls":4},70]
[{"$nulls":4},71,{"$f":"INDEX(menues!$1:$1048576,$E71,sprache)","v":0}]
["Mittlere einfache Transportentfernung, Bahn","Distance moyenne de transport, train",null,null,72,{"$f":"INDEX(menues!$1:$1048576,$E72,sprache)","v":"Mittlere einfache Transportentfernung, Bahn"}]
["Mittlere einfache Transportentfernung, Schiff","Distance moyenne de transport, bateau",null,null,73,{"$f":"INDEX(menues!$1:$1048576,$E73,sprache)","v":"Mittlere einfache Transportentfernung, Schiff"}]
["Holzpellets","Granulés de bois",null,null,74]
["Holzschnitzel, Laubbaum","Bois frais déchiqueté (feuillu)   ",null,null,75]
["Holzschnitzel, Nadelbaum","Bois frais déchiqueté (résineux)   ",null,null,76]
["Holzschnitzel, Restholz (z.B. aus Sägerei)","Restes de bois déchiquetés (p.ex. déchets de sciage) ",null,null,77]
["Holzschnitzel, Altholz","Bois usagé déchiqueté",null,null,78]
["Total","Total",null,null,79]
["Holzmenge","Quantité de bois",null,null,80]
["Stickoxide NOx als NO2 / Emissionsgrenzwerte gemäss LRV","Oxydes d'azote NOx en NO2 / valeur-limite selon OPair",null,null,81]
["Staub (= Feststoffe), PM10 / Emissionsgrenzwerte gemäss LRV","PM2.5, Particules, poussière / valeur-limite selon OPair",null,null,82]
["Blei / Emissionsgrenzwerte gemäss LRV","Plomb / valeur-limite selon OPair",null,null,83]
["Cadmium / Emissionsgrenzwerte gemäss LRV","Cadmium / valeur-limite selon OPair",null,null,84]
["Zink / Emissionsgrenzwerte gemäss LRV","Zinc / valeur-limite selon OPair",null,null,85]
[{"$nulls":4},86]
["Dieselverbrauch (10 kWh/Liter)","Consommation de diesel (10 kWh/litre)",null,null,87]
["Referenz Güllelager","Référence pour le dépôt de lisier",null,null,88]
["Referenz Kompost","Référence pour le compost",null,null,89]
["Referenz Frischklärschlamm","Référence pour les boues d'épuration fraîches",null,null,90]
["Grenzwert Kälte","Valeur-limite froid",null,null,91]
[{"$nulls":4},92]
["Energiebezug der Anlage (Systemgrenzen beachten)","Achat d'énergie pour l'installation (cf.limites du système)",null,null,93]
["bis 70 kW","jusqu' à 70 kW",null,null,94,{"$f":"INDEX(menues!$1:$1048576,$E94,sprache)","v":"bis 70 kW"}]
["70 kW bis 500 kW","70 kw à 500 kW",null,null,95,{"$f":"INDEX(menues!$1:$1048576,$E95,sprache)","v":"70 kW bis 500 kW"}]
["500 kW bis 1 MW","500 kW à 1 MW",null,null,96,{"$f":"INDEX(menues!$1:$1048576,$E96,sprache)","v":"500 kW bis 1 MW"}]
["1 MW bis 10 MW","1 MW à 10 MW",null,null,97,{"$f":"INDEX(menues!$1:$1048576,$E97,sprache)","v":"1 MW bis 10 MW"}]
["über 10 MW","plus de 10 MW",null,null,98,{"$f":"INDEX(menues!$1:$1048576,$E98,sprache)","v":"über 10 MW"}]
["Gesamtproduktion Strom, Brutto","Production totale de courant, brut",null,null,99]
["Eigenverbrauch der Anlage","Consommation propre de l'installation",null,null,100]
[{"$nulls":4},101]
["Gesamtmenge Energieprodukte","Quantité totale des produits d'énergie",null,null,102]
[{"$nulls":4},103]

{"sheet":"LCIA","index":5,"n_rows":240,"n_cols":35,"rows_kept":240,"cut":false,"hidden":true,"merged":[]}
["Zeile",null,75,76,77,74,78,23,9,10,87,18,21,21,21,30,24,16,21,21,21,21,21,null,81,82,83,84,85,32,64,64,64,64,64]
[null,null,{"$f":"INDEX(menues!$1:$1048576,C1,sprache)","v":"Holzschnitzel, Laubbaum"},{"$f":"INDEX(menues!$1:$1048576,D1,sprache)","v":"Holzschnitzel, Nadelbaum"},{"$f":"INDEX(menues!$1:$1048576,E1,sprache)","v":"Holzschnitzel, Restholz (z.B. aus Sägerei)"},{"$f":"INDEX(menues!$1:$1048576,F1,sprache)","v":"Holzpellets"},{"$f":"INDEX(menues!$1:$1048576,G1,sprache)","v":"Holzschnitzel, Altholz"},{"$f":"INDEX(menues!$1:$1048576,H1,sprache)","v":"Rapsölmethylester"},{"$f":"INDEX(menues!$1:$1048576,I1,sprache)","v":"Strombezug aus Netz"},{"$f":"INDEX(menues!$1:$1048576,J1,sprache)","v":"Heizölverbrauch"},{"$f":"INDEX(menues!$1:$1048576,K1,sprache)","v":"Dieselverbrauch (10 kWh/Liter)"},{"$f":"INDEX(menues!$1:$1048576,L1,sprache)","v":"Erdgasverbrauch"},{"$f":"INDEX(menues!$1:$1048576,M1,sprache)","v":"Gesamtinputmenge für Anlage"},{"$f":"INDEX(menues!$1:$1048576,N1,sprache)","v":"Gesamtinputmenge für Anlage"},{"$f":"INDEX(menues!$1:$1048576,O1,sprache)","v":"Gesamtinputmenge für Anlage"},{"$f":"INDEX(menues!$1:$1048576,P1,sprache)","v":"Einfache Distanz Anlage - Ausbringung/Entsorgung"},{"$f":"INDEX(menues!$1:$1048576,Q1,sprache)","v":"ungewollte Biogas Verluste (Methanschlupf und Unterbrüche)"},{"$f":"INDEX(menues!$1:$1048576,R1,sprache)","v":"Biomethan: Verkauf und Verbrauch ausserhalb der Anlage"},{"$f":"INDEX(menues!$1:$1048576,S1,sprache)","v":"Gesamtinputmenge für Anlage"},{"$f":"INDEX(menues!$1:$1048576,T1,sprache)","v":"Gesamtinputmenge für Anlage"},{"$f":"INDEX(menues!$1:$1048576,U1,sprache)","v":"Gesamtinputmenge für Anlage"},{"$f":"INDEX(menues!$1:$1048576,V1,sprache)","v":"Gesamtinputmenge für Anlage"},{"$f":"INDEX(menues!$1:$1048576,W1,sprache)","v":"Gesamtinputmenge für Anlage"},"Nm3/a",{"$f":"INDEX(menues!$1:$1048576,Y1,sprache)","v":"Stickoxide NOx als NO2 / Emissionsgrenzwerte gemäss LRV"},{"$f":"INDEX(menues!$1:$1048576,Z1,sprache)","v":"Staub (= Feststoffe), PM10 / Emissionsgrenzwerte gemäss LRV"},{"$f":"INDEX(menues!$1:$1048576,AA1,sprache)","v":"Blei / Emissionsgrenzwerte gemäss LRV"},{"$f":"INDEX(menues!$1:$1048576,AB1,sprache)","v":"Cadmium / Emissionsgrenzwerte gemäss LRV"},{"$f":"INDEX(menues!$1:$1048576,AC1,sprache)","v":"Zink / Emissionsgrenzwerte gemäss LRV"},{"$f":"INDEX(menues!$1:$1048576,AD1,sprache)","v":"Einspeisung Wärmeverbund / Verteilverluste"},{"$f":"INDEX(menues!$1:$1048576,AE1,sprache)","v":"Aschen zur Entsorgung"},{"$f":"INDEX(menues!$1:$1048576,AF1,sprache)","v":"Aschen zur Entsorgung"},{"$f":"INDEX(menues!$1:$1048576,AG1,sprache)","v":"Aschen zur Entsorgung"},{"$f":"INDEX(menues!$1:$1048576,AH1,sprache)","v":"Aschen zur Entsorgung"},{"$f":"INDEX(menues!$1:$1048576,AI1,sprache)","v":"Aschen zur Entsorgung"}]
["Eingabe 1",null,{"$f":"INDEX(Prüfung!$1:$1048576,MATCH(C$1,Prüfung!$A:$A,0),3)","v":0},{"$f":"INDEX(Prüfung!$1:$1048576,MATCH(D$1,Prüfung!$A:$A,0),3)","v":0},{"$f":"INDEX(Prüfung!$1:$1048576,MATCH(E$1,Prüfung!$A:$A,0),3)","v":0},{"$f":"INDEX(Prüfung!$1:$1048576,MATCH(F$1,Prüfung!$A:$A,0),3)","v":0},{"$f":"INDEX(Prüfung!$1:$1048576,MATCH(G$1,Prüfung!$A:$A,0),3)","v":0},{"$f":"INDEX(Prüfung!$1:$1048576,MATCH(H$1,Prüfung!$A:$A,0),3)","v":0},{"$f":"INDEX(Prüfung!$1:$1048576,MATCH(I$1,Prüfung!$A:$A,0),3)","v":0},{"$f":"INDEX(Prüfung!$1:$1048576,MATCH(J$1,Prüfung!$A:$A,0),3)","v":0},{"$f":"INDEX(Prüfung!$1:$1048576,MATCH(K$1,Prüfung!$A:$A,0),3)","v":0},{"$f":"INDEX(Prüfung!$1:$1048576,MATCH(L$1,Prüfung!$A:$A,0),3)","v":0},{"$f":"INDEX(Prüfung!$1:$1048576,MATCH(M$1,Prüfung!$A:$A,0),3)","v":0},{"$f":"INDEX(Prüfung!$1:$1048576,MATCH(N$1,Prüfung!$A:$A,0),3)","v":0},{"$f":"INDEX(Prüfung!$1:$1048576,MATCH(O$1,Prüfung!$A:$A,0),3)","v":0},{"$f":"INDEX(Prüfung!$1:$1048576,MATCH(P$1,Prüfung!$A:$A,0),3)","v":0},{"$f":"INDEX(Prüfung!$1:$1048576,MATCH(Q$1,Prüfung!$A:$A,0),3)","v":0},{"$f":"INDEX(Prüfung!$1:$1048576,MATCH(R$1,Prüfung!$A:$A,0),3)","v":0},{"$f":"INDEX(Prüfung!$1:$1048576,MATCH(S$1,Prüfung!$A:$A,0),3)","v":0},{"$f":"INDEX(Prüfung!$1:$1048576,MATCH(T$1,Prüfung!$A:$A,0),3)","v":0},{"$f":"INDEX(Prüfung!$1:$1048576,MATCH(U$1,Prüfung!$A:$A,0),3)","v":0},{"$f":"INDEX(Prüfung!$1:$1048576,MATCH(V$1,Prüfung!$A:$A,0),3)","v":0},{"$f":"INDEX(Prüfung!$1:$1048576,MATCH(W$1,Prüfung!$A:$A,0),3)","v":0},null,{"$f":"INDEX(Prüfung!$1:$1048576,MATCH(Y$1,Prüfung!$A:$A,0),3)","v":250},{"$f":"INDEX(Prüfung!$1:$1048576,MATCH(Z$1,Prüfung!$A:$A,0),3)","v":20},{"$f":"INDEX(Prüfung!$1:$1048576,MATCH(AA$1,Prüfung!$A:$A,0),3)","v":0},{"$f":"INDEX(Prüfung!$1:$1048576,MATCH(AB$1,Prüfung!$A:$A,0),3)","v":0},{"$f":"INDEX(Prüfung!$1:$1048576,MATCH(AC$1,Prüfung!$A:$A,0),3)","v":0},{"$f":"INDEX(Prüfung!$1:$1048576,MATCH(AD$1,Prüfung!$A:$A,0),3)","v":0},{"$f":"INDEX(Prüfung!$1:$1048576,MATCH(AE$1,Prüfung!$A:$A,0),3)","v":0},{"$f":"INDEX(Prüfung!$1:$1048576,MATCH(AF$1,Prüfung!$A:$A,0),3)","v":0},{"$f":"INDEX(Prüfung!$1:$1048576,MATCH(AG$1,Prüfung!$A:$A,0),3)","v":0},{"$f":"INDEX(Prüfung!$1:$1048576,MATCH(AH$1,Prüfung!$A:$A,0),3)","v":0},{"$f":"INDEX(Prüfung!$1:$1048576,MATCH(AI$1,Prüfung!$A:$A,0),3)","v":0}]
["Eingabe 2","W Wassergehalt",{"$f":"INDEX(Prüfung!$1:$1048576,MATCH(C$1,Prüfung!$A:$A,0),4)","v":0.45},{"$f":"INDEX(Prüfung!$1:$1048576,MATCH(D$1,Prüfung!$A:$A,0),4)","v":0.45},{"$f":"INDEX(Prüfung!$1:$1048576,MATCH(E$1,Prüfung!$A:$A,0),4)","v":0.2857142857142857},{"$f":"INDEX(Prüfung!$1:$1048576,MATCH(F$1,Prüfung!$A:$A,0),4)","v":9.0909090909090981E-2},{"$f":"INDEX(Prüfung!$1:$1048576,MATCH(G$1,Prüfung!$A:$A,0),4)","v":0.2857142857142857},{"$f":"INDEX(Prüfung!$1:$1048576,MATCH(H$1,Prüfung!$A:$A,0),4)","v":0},{"$f":"INDEX(Prüfung!$1:$1048576,MATCH(I$1,Prüfung!$A:$A,0),4)","v":0},{"$f":"INDEX(Prüfung!$1:$1048576,MATCH(J$1,Prüfung!$A:$A,0),4)","v":0},{"$f":"INDEX(Prüfung!$1:$1048576,MATCH(K$1,Prüfung!$A:$A,0),4)","v":0},{"$f":"INDEX(Prüfung!$1:$1048576,MATCH(L$1,Prüfung!$A:$A,0),4)","v":0},{"$f":"INDEX(Prüfung!$1:$1048576,MATCH(M$1,Prüfung!$A:$A,0),4)","v":{"$error":"#DIV/0!"}},{"$f":"INDEX(Prüfung!$1:$1048576,MATCH(N$1,Prüfung!$A:$A,0),4)","v":{"$error":"#DIV/0!"}},{"$f":"INDEX(Prüfung!$1:$1048576,MATCH(O$1,Prüfung!$A:$A,0),4)","v":{"$error":"#DIV/0!"}},{"$f":"INDEX(Prüfung!$1:$1048576,MATCH(P$1,Prüfung!$A:$A,0),4)","v":0},{"$f":"INDEX(Prüfung!$1:$1048576,MATCH(Q$1,Prüfung!$A:$A,0),4)","v":0},{"$f":"INDEX(Prüfung!$1:$1048576,MATCH(R$1,Prüfung!$A:$A,0),4)","v":0},{"$f":"INDEX(Prüfung!$1:$1048576,MATCH(S$1,Prüfung!$A:$A,0),4)","v":{"$error":"#DIV/0!"}},{"$f":"INDEX(Prüfung!$1:$1048576,MATCH(T$1,Prüfung!$A:$A,0),4)","v":{"$error":"#DIV/0!"}},{"$f":"INDEX(Prüfung!$1:$1048576,MATCH(U$1,Prüfung!$A:$A,0),4)","v":{"$error":"#DIV/0!"}},{"$f":"INDEX(Prüfung!$1:$1048576,MATCH(V$1,Prüfung!$A:$A,0),4)","v":{"$error":"#DIV/0!"}},{"$f":"INDEX(Prüfung!$1:$1048576,MATCH(W$1,Prüfung!$A:$A,0),4)","v":{"$error":"#DIV/0!"}},null,{"$f":"Y5*kWhHolz_tAtro*3.6*1000000/1000/Nm3_kgAtro","v":226.24},{"$f":"Z5*kWhHolz_tAtro*3.6*1000000/1000/Nm3_kgAtro","v":224.21999999999994},{"$f":"AA5*kWhHolz_tAtro*3.6*1000000/1000/Nm3_kgAtro","v":5.0499999999999989E-2},{"$f":"AB5*kWhHolz_tAtro*3.6*1000000/1000/Nm3_kgAtro","v":1.4139999999999995E-3},{"$f":"AC5*kWhHolz_tAtro*3.6*1000000/1000/Nm3_kgAtro","v":0.60599999999999998},{"$f":"INDEX(Prüfung!$1:$1048576,MATCH(AD$1,Prüfung!$A:$A,0),4)","v":0.20300000000000001},{"$f":"INDEX(Prüfung!$1:$1048576,MATCH(AE$1,Prüfung!$A:$A,0),4)","v":0},{"$f":"INDEX(Prüfung!$1:$1048576,MATCH(AF$1,Prüfung!$A:$A,0),4)","v":0},{"$f":"INDEX(Prüfung!$1:$1048576,MATCH(AG$1,Prüfung!$A:$A,0),4)","v":0},{"$f":"INDEX(Prüfung!$1:$1048576,MATCH(AH$1,Prüfung!$A:$A,0),4)","v":0},{"$f":"INDEX(Prüfung!$1:$1048576,MATCH(AI$1,Prüfung!$A:$A,0),4)","v":0}]
["Eingabe 3","U Feuchte",{"$f":"IF(C3>0,(C18/C17-1),0)","v":0},{"$f":"IF(D3>0,(D18/D17-1),0)","v":0},{"$f":"IF(E3>0,(E18/E17-1),0)","v":0},{"$f":"IF(F3>0,(F18/F17-1),0)","v":0},{"$f":"IF(G3>0,(G18/G17-1),0)","v":0},{"$f":"INDEX(Prüfung!$1:$1048576,MATCH(H$1,Prüfung!$A:$A,0),5)","v":0},{"$f":"INDEX(Prüfung!$1:$1048576,MATCH(I$1,Prüfung!$A:$A,0),5)","v":0},{"$f":"INDEX(Prüfung!$1:$1048576,MATCH(J$1,Prüfung!$A:$A,0),5)","v":0},{"$f":"INDEX(Prüfung!$1:$1048576,MATCH(K$1,Prüfung!$A:$A,0),5)","v":0},{"$f":"INDEX(Prüfung!$1:$1048576,MATCH(L$1,Prüfung!$A:$A,0),5)","v":0},{"$f":"INDEX(Prüfung!$1:$1048576,MATCH(M$1,Prüfung!$A:$A,0),5)","v":{"$error":"#DIV/0!"}},{"$f":"INDEX(Prüfung!$1:$1048576,MATCH(N$1,Prüfung!$A:$A,0),5)","v":{"$error":"#DIV/0!"}},{"$f":"INDEX(Prüfung!$1:$1048576,MATCH(O$1,Prüfung!$A:$A,0),5)","v":{"$error":"#DIV/0!"}},{"$f":"INDEX(Prüfung!$1:$1048576,MATCH(P$1,Prüfung!$A:$A,0),5)","v":0},{"$f":"INDEX(Prüfung!$1:$1048576,MATCH(Q$1,Prüfung!$A:$A,0),5)","v":0},{"$f":"INDEX(Prüfung!$1:$1048576,MATCH(R$1,Prüfung!$A:$A,0),5)","v":0},{"$f":"INDEX(Prüfung!$1:$1048576,MATCH(S$1,Prüfung!$A:$A,0),5)","v":{"$error":"#DIV/0!"}},{"$f":"INDEX(Prüfung!$1:$1048576,MATCH(T$1,Prüfung!$A:$A,0),5)","v":{"$error":"#DIV/0!"}},{"$f":"INDEX(Prüfung!$1:$1048576,MATCH(U$1,Prüfung!$A:$A,0),5)","v":{"$error":"#DIV/0!"}},{"$f":"INDEX(Prüfung!$1:$1048576,MATCH(V$1,Prüfung!$A:$A,0),5)","v":{"$error":"#DIV/0!"}},{"$f":"INDEX(Prüfung!$1:$1048576,MATCH(W$1,Prüfung!$A:$A,0),5)","v":{"$error":"#DIV/0!"}},{"$f":"Nm3_kgAtro/kWhHolz_tAtro*1000/3.6*$V3*3.6-R5*1000*Y16","v":0},1.12E-4,1.11E-4,2.4999999999999999E-8,6.9999999999999975E-10,3.0000000000000004E-7,{"$f":"INDEX(Prüfung!$1:$1048576,MATCH(AD$1,Prüfung!$A:$A,0),5)","v":{"$error":"#DIV/0!"}},{"$f":"INDEX(Prüfung!$1:$1048576,MATCH(AE$1,Prüfung!$A:$A,0),5)","v":0},{"$f":"INDEX(Prüfung!$1:$1048576,MATCH(AF$1,Prüfung!$A:$A,0),5)","v":0},{"$f":"INDEX(Prüfung!$1:$1048576,MATCH(AG$1,Prüfung!$A:$A,0),5)","v":0},{"$f":"INDEX(Prüfung!$1:$1048576,MATCH(AH$1,Prüfung!$A:$A,0),5)","v":0},{"$f":"INDEX(Prüfung!$1:$1048576,MATCH(AI$1,Prüfung!$A:$A,0),5)","v":0}]
["Eingabe 4",6,{"$f":"INDEX(Prüfung!$1:$1048576,MATCH(C$1,Prüfung!$A:$A,0),$B6)","v":0},{"$f":"INDEX(Prüfung!$1:$1048576,MATCH(D$1,Prüfung!$A:$A,0),$B6)","v":0},{"$f":"INDEX(Prüfung!$1:$1048576,MATCH(E$1,Prüfung!$A:$A,0),$B6)","v":0},{"$f":"INDEX(Prüfung!$1:$1048576,MATCH(F$1,Prüfung!$A:$A,0),$B6)","v":0},{"$f":"INDEX(Prüfung!$1:$1048576,MATCH(G$1,Prüfung!$A:$A,0),$B6)","v":0},{"$f":"INDEX(Prüfung!$1:$1048576,MATCH(H$1,Prüfung!$A:$A,0),$B6)","v":0},{"$f":"INDEX(Prüfung!$1:$1048576,MATCH(I$1,Prüfung!$A:$A,0),6)","v":0},{"$f":"INDEX(Prüfung!$1:$1048576,MATCH(J$1,Prüfung!$A:$A,0),6)","v":0},{"$f":"INDEX(Prüfung!$1:$1048576,MATCH(K$1,Prüfung!$A:$A,0),6)","v":0},{"$f":"INDEX(Prüfung!$1:$1048576,MATCH(L$1,Prüfung!$A:$A,0),6)","v":0},{"$f":"SUMPRODUCT($C18:$H18,$C6:$H6)","v":0},{"$f":"SUMPRODUCT($C18:$H18,$C7:$H7)","v":0},{"$f":"SUMPRODUCT($C18:$H18,$C8:$H8)","v":0},{"$f":"INDEX(Prüfung!$1:$1048576,MATCH(P$1,Prüfung!$A:$A,0),6)","v":0},{"$f":"INDEX(Prüfung!$1:$1048576,MATCH(Q$1,Prüfung!$A:$A,0),6)","v":0},{"$f":"INDEX(Prüfung!$1:$1048576,MATCH(R$1,Prüfung!$A:$A,0),6)","v":0},{"$f":"INDEX(Prüfung!$1:$1048576,MATCH(S$1,Prüfung!$A:$A,0),6)","v":0},{"$f":"INDEX(Prüfung!$1:$1048576,MATCH(T$1,Prüfung!$A:$A,0),6)","v":0},{"$f":"INDEX(Prüfung!$1:$1048576,MATCH(U$1,Prüfung!$A:$A,0),6)","v":0},{"$f":"INDEX(Prüfung!$1:$1048576,MATCH(V$1,Prüfung!$A:$A,0),6)","v":0},{"$f":"INDEX(Prüfung!$1:$1048576,MATCH(W$1,Prüfung!$A:$A,0),6)","v":0},null,{"$f":"(Y3-Y4)*0.000001*Nm3_Abgas","v":0},{"$f":"(Z3-Z4)*0.000001*Nm3_Abgas","v":0},{"$f":"(AA3-AA4)*0.000001*Nm3_Abgas","v":0},{"$f":"(AB3-AB4)*0.000001*Nm3_Abgas","v":0},{"$f":"(AC3-AC4)*0.000001*Nm3_Abgas","v":0},{"$f":"INDEX(Prüfung!$1:$1048576,MATCH(AD$1,Prüfung!$A:$A,0),6)","v":0},{"$f":"INDEX(Prüfung!$1:$1048576,MATCH(AE$1,Prüfung!$A:$A,0),6)","v":100},{"$f":"INDEX(Prüfung!$1:$1048576,MATCH(AF$1,Prüfung!$A:$A,0),6)","v":100},{"$f":"INDEX(Prüfung!$1:$1048576,MATCH(AG$1,Prüfung!$A:$A,0),6)","v":100},{"$f":"INDEX(Prüfung!$1:$1048576,MATCH(AH$1,Prüfung!$A:$A,0),6)","v":100},{"$f":"INDEX(Prüfung!$1:$1048576,MATCH(AI$1,Prüfung!$A:$A,0),6)","v":100}]
["Eingabe 5",7,{"$f":"INDEX(Prüfung!$1:$1048576,MATCH(C$1,Prüfung!$A:$A,0),$B7)","v":0},{"$f":"INDEX(Prüfung!$1:$1048576,MATCH(D$1,Prüfung!$A:$A,0),$B7)","v":0},{"$f":"INDEX(Prüfung!$1:$1048576,MATCH(E$1,Prüfung!$A:$A,0),$B7)","v":0},{"$f":"INDEX(Prüfung!$1:$1048576,MATCH(F$1,Prüfung!$A:$A,0),$B7)","v":0},{"$f":"INDEX(Prüfung!$1:$1048576,MATCH(G$1,Prüfung!$A:$A,0),$B7)","v":0},{"$f":"INDEX(Prüfung!$1:$1048576,MATCH(H$1,Prüfung!$A:$A,0),$B7)","v":0}]
["Eingabe 6",8,{"$f":"INDEX(Prüfung!$1:$1048576,MATCH(C$1,Prüfung!$A:$A,0),$B8)","v":0},{"$f":"INDEX(Prüfung!$1:$1048576,MATCH(D$1,Prüfung!$A:$A,0),$B8)","v":0},{"$f":"INDEX(Prüfung!$1:$1048576,MATCH(E$1,Prüfung!$A:$A,0),$B8)","v":0},{"$f":"INDEX(Prüfung!$1:$1048576,MATCH(F$1,Prüfung!$A:$A,0),$B8)","v":0},{"$f":"INDEX(Prüfung!$1:$1048576,MATCH(G$1,Prüfung!$A:$A,0),$B8)","v":0},{"$f":"INDEX(Prüfung!$1:$1048576,MATCH(H$1,Prüfung!$A:$A,0),$B8)","v":0}]
["Umrechnungsfaktor",null,{"$f":"C3*(1-C4)/(1-C15)","v":0},{"$f":"D3*(1-D4)/(1-D15)","v":0},{"$f":"E3*(1-E4)/(1-E15)","v":0},{"$f":"F3*(1-F4)/(1-F15)","v":0},{"$f":"G3*(1-G4)/(1-G15)","v":0},{"$f":"H3","v":0},{"$f":"I3","v":0},{"$f":"J3","v":0},{"$f":"K3","v":0},{"$f":"L3","v":0},{"$f":"M6","v":0},{"$f":"N6","v":0},{"$f":"O6","v":0},{"$f":"P6","v":0},{"$f":"Q3","v":0},{"$f":"IF(Anlagentyp=R14,R5*1,0)","v":0},{"$f":"IF(Anlagentyp=S14,S3*1,0)","v":0},{"$f":"IF(Anlagentyp=T14,T3*1,0)","v":0},{"$f":"IF(Anlagentyp=U14,U3*1,0)","v":0},{"$f":"IF(Anlagentyp=V14,V3*1,0)","v":0},{"$f":"IF(Anlagentyp=W14,W3*1,0)","v":0},{"$f":"IF(SUM(V9:W9)>0,Nm3_Abgas,0)","v":0},{"$f":"Y6","v":0},{"$f":"Z6","v":0},{"$f":"IF(altholzverbrennung,AA6,0)","v":0},{"$f":"IF(altholzverbrennung,AB6,0)","v":0},{"$f":"IF(altholzverbrennung,AC6,0)","v":0},{"$f":"AD3","v":0},{"$f":"IF(Auswahl_Behandlung_fest=LCIA!AE14,LCIA!AE4,0)","v":0},{"$f":"IF(Auswahl_Behandlung_fest=LCIA!AF14,LCIA!AF4,0)","v":0},{"$f":"IF(Auswahl_Behandlung_fest=LCIA!AG14,LCIA!AG4,0)","v":0},{"$f":"IF(Auswahl_Behandlung_fest=LCIA!AH14,LCIA!AH4,0)","v":0},{"$f":"IF(Auswahl_Behandlung_fest=LCIA!AI14,LCIA!AI4,0)","v":0}]
["Eco-indicator",{"$f":"SUM(C10:AI10)","v":0},{"$f":"C67*C9","v":0},0,0,0,0,0,0,{"$f":"J67*J$9","v":0},{"$f":"K67*K9","v":0},0,0,{"$f":"N67*N9","v":0},{"$f":"O67*O9","v":0},0,0,0,0,0,0,0,0,{"$f":"X67*X9","v":0},{"$f":"Y67*Y9","v":0},0,0,0,0,0,0,0,0,0,0]
[{"$f":"A119","v":"IPCC GWP 100a"},{"$f":"SUM(C11:AI11)","v":0},{"$f":"C119*C$9","v":0},0,0,0,0,0,0,0,0,0,0,{"$f":"N119*N$9","v":0},{"$f":"O119*O$9","v":0},0,0,0,0,0,0,0,{"$f":"W119*W$9","v":0},{"$f":"X119*X$9","v":0},0,0,0,0,0,0,0,0,0,0,0]
[{"$f":"B123","v":"Impact assessment"},{"$f":"SUM(C12:AI12)","v":0},{"$f":"C167*C$9","v":0},0,0,0,0,0,0,0,0,0,0,0,0,0,0,0,0,0,0,0,0,0,0,0,0,0,0,0,0,0,0,0,0]
[{"$f":"B175","v":"Impact assessment"},{"$f":"SUM(C13:AI13)","v":0},{"$f":"C219*C$9","v":0},0,0,0,0,0,0,0,0,0,0,0,0,0,0,0,0,0,0,0,0,0,0,0,0,0,0,0,0,0,0,0,0]
["Holz atro ecoinvent","t/m3",0.23899999999999999,0.16900000000000001,0.189,0.65,0.189,{"$nulls":11},1,2,3,4,5,{"$nulls":7},1,null,2,3,4]
["W Wassergehalt","%",{"$f":"((C16+1)*C14-C14)/((C16+1)*C14)","v":0.44444444444444442},{"$f":"((D16+1)*D14-D14)/((D16+1)*D14)","v":0.58333333333333337},{"$f":"((E16+1)*E14-E14)/((E16+1)*E14)","v":0.2857142857142857},{"$f":"((F16+1)*F14-F14)/((F16+1)*F14)","v":9.0909090909090981E-2},{"$f":"((G16+1)*G14-G14)/((G16+1)*G14)","v":0.2857142857142857},{"$nulls":16},{"$f":"SUM(X10:AC10)","v":0},10,"Nm3/kg atro"]
["U feuchte ecoinvent","%",0.8,1.4,0.4,0.1,0.4,{"$nulls":17},22.9,"Nm3/kg Biomethan"]
["Holz atro Anlage","t/m3",{"$f":"C14*C9","v":0},{"$f":"D14*D9","v":0},{"$f":"E14*E9","v":0},{"$f":"F14*F9","v":0},{"$f":"G14*G9","v":0},{"$nulls":17},{"$f":"20.2/3.6*1000","v":5611.1111111111104},"kWhHolz_tAtro"]
["Holz FM Anlage","t FM",{"$f":"C17/(1-C4)","v":0},{"$f":"D17/(1-D4)","v":0},{"$f":"E17/(1-E4)","v":0},{"$f":"F17/(1-F4)","v":0},{"$f":"G17/(1-G4)","v":0},{"$f":"H5","v":0}]
["unterer Heizwert","kWh",{"$f":"1000*C18*(20.2*0.8-0.2*(100*C5*100/(100+C5*100)))/3.6","v":0},{"$f":"1000*D18*(20.2*0.8-0.2*(100*D5*100/(100+D5*100)))/3.6","v":0},{"$f":"1000*E18*(20.2*0.8-0.2*(100*E5*100/(100+E5*100)))/3.6","v":0},{"$f":"1000*F18*(20.2*0.8-0.2*(100*F5*100/(100+F5*100)))/3.6","v":0},{"$f":"1000*G18*(20.2*0.8-0.2*(100*G5*100/(100+G5*100)))/3.6","v":0}]
[]
["Calculation: ","Compare"]
["Results: ","Impact assessment"]
["Product 1: ","1 m3 Wood chips, hardwood, u=80%, at forest/RER U (of project ESU database 2019)"]
["Product 2: ","1 m3 Wood chips, softwood, u=140%, at forest/RER U (of project ESU database 2019)"]
["Product 3: ","1 m3 Wood chips, mixed, from industry, u=40%, at plant/RER U (of project ESU database 2019)"]
["Product 4: ","1 m3 Wood pellets, u=10%, at storehouse/RER U (of project ESU database 2019)"]
["Product 5: ","1 m3 Waste wood chips, mixed, from industry, u=40%, at plant/CH U (of project ESU database 2019)"]
["Product 6: ","1000 kg Rape methyl ester, at regional storage/CH U (of project ESU database 2019)"]
["Product 7: ","1 kWh electricity, medium voltage, at grid/kWh/CH U (of project ESU database 2019)"]
["Product 8: ","3.6 MJ light fuel oil, burned in industrial furnace 1MW, non-modulating/MJ/CH U (of project ESU database 2019)"]
["Product 9: ","3.6 MJ Diesel, burned in building machine/GLO U (of project ESU database 2019)"]
["Product 10: ","3.6 MJ Natural gas, burned in boiler condensing modulating >100kW/RER U (of project ESU database 2019)"]
["Product 11: ","1 tkm Transport, lorry 20-28t, fleet average/CH U (of project ESU database 2019)"]
["Product 12: ","1 tkm Transport, freight, rail/RER U (of project ESU database 2019)"]
["Product 13: ","1 tkm Transport, transoceanic freight ship/OCE U (of project ESU database 2019)"]
["Product 14: ","1 tkm Transport, tractor and trailer/CH U (of project ESU database 2019)"]
["Product 15: ","1 kWh biogas, vented/CH U (of project 208 naturemade KWM)"]
["Product 16: ","1 kWh methane, 96 vol-%, purification and distribution/kWh/CH U (of project 208 naturemade KWM)"]
["Product 17: ","1 kWh wood chips combustion, burned in furnace/MJ/CH U (of project 208 naturemade KWM)"]
["Product 18: ","1 kWh wood chips combustion, burned in cogen 6400kWth/MJ/CH U (of project 208 naturemade KWM)"]
["Product 19: ","1 kWh wood chips combustion, burned in cogen ORC 1400kWth/MJ/CH U (of project 208 naturemade KWM)"]
["Product 20: ","1 kWh wood chips, gasified in cogen, fixed bed/MJ/KWM U (of project 208 naturemade KWM)"]
["Product 21: ","1 kWh wood chips, in fluidized bed gasification, with biomethane production/MJ/KWM U (of project 208 naturemade KWM)"]
["Product 22: ","1 m3 emission, gasification/m3/KWM U (of project 208 naturemade KWM)"]
["Product 23: ","1 kg emission, NOx/kg/CH U (of project 208 naturemade KWM)"]
["Product 24: ","1 kg emission, PM2.5/kg/CH U (of project 208 naturemade KWM)"]
["Product 25: ","1 kg emission, lead/kg/CH U (of project 208 naturemade KWM)"]
["Product 26: ","1 kg emission, cadmium/kg/CH U (of project 208 naturemade KWM)"]
["Product 27: ","1 kg emission, zinc/kg/CH U (of project 208 naturemade KWM)"]
["Product 28: ","1 kWh transport, district heat network, average/CH/I U (of project 208 naturemade KWM)"]
["Product 29: ","1000 kg disposal, wood ash mixture, pure, 0% water, to municipal incineration/kg/CH U (of project ESU database 2019)"]
["Product 30: ","1000 kg Disposal, inert waste, 5% water, to inert material landfill/CH U (of project ESU database 2019)"]
["Product 31: ","1 ton disposal, filter dust, wood, to residual material landfill/CH U (of project 208 naturemade KWM)"]
["Product 32: ","1000 kg Disposal, hazardous waste, 0% water, to underground deposit/DE U (of project ESU database 2019)"]
["Product 33: ","1000 kg Disposal, wood ash mixture, pure, 0% water, to landfarming/CH U (of project ESU database 2019)"]
["Method: ","Eco-indicator 99 (H) V2.10 / Europe EI 99 H/A"]
["Indicator: ","Single score"]
["Skip categories: ","Never"]
["Default units: ","Yes"]
["Exclude infrastructure processes: ","No"]
["Exclude long-term emissions: ","Yes"]
["Per impact category: ","No"]
["Sorted on item: ","Damage category"]
["Sort order: ","Ascending"]
[]
["Damage category","Unit","Wood chips, hardwood, u=80%, at forest/RER U","Wood chips, softwood, u=140%, at forest/RER U","Wood chips, mixed, from industry, u=40%, at plant/RER U","Wood pellets, u=10%, at storehouse/RER U","Waste wood chips, mixed, from industry, u=40%, at plant/CH U","Rape methyl ester, at regional storage/CH U","electricity, medium voltage, at grid/kWh/CH U","light fuel oil, burned in industrial furnace 1MW, non-modulating/MJ/CH U","Diesel, burned in building machine/GLO U","Natural gas, burned in boiler condensing modulating >100kW/RER U","Transport, lorry 20-28t, fleet average/CH U","Transport, freight, rail/RER U","Transport, transoceanic freight ship/OCE U","Transport, tractor and trailer/CH U","biogas, vented/CH U","methane, 96 vol-%, purification and distribution/kWh/CH U","wood chips combustion, burned in furnace/MJ/CH U","wood chips combustion, burned in cogen 6400kWth/MJ/CH U","wood chips combustion, burned in cogen ORC 1400kWth/MJ/CH U","wood chips, gasified in cogen, fixed bed/MJ/KWM U","wood chips, in fluidized bed gasification, with biomethane production/MJ/KWM U","emission, gasification/m3/KWM U","emission, NOx/kg/CH U","emission, PM2.5/kg/CH U","emission, lead/kg/CH U","emission, cadmium/kg/CH U","emission, zinc/kg/CH U","transport, district heat network, average/CH/I U","disposal, wood ash mixture, pure, 0% water, to municipal incineration/kg/CH U","Disposal, inert waste, 5% water, to inert material landfill/CH U","disposal, filter dust, wood, to residual material landfill/CH U","Disposal, hazardous waste, 0% water, to underground deposit/DE U","Disposal, wood ash mixture, pure, 0% water, to landfarming/CH U"]
["Total","Pt",2.8970663999999999,1.8026759000000001,0.69841465000000003,12.485645999999999,0.4367453,657.17071999999996,6.3858774E-3,2.3134434999999998E-2,5.5851981000000002E-2,2.0926868000000001E-2,2.3827946999999999E-2,3.4913637000000002E-3,1.8655715000000001E-3,3.9501148E-2,1.2469478000000001E-2,8.4590315999999999E-5,1.5177533E-2,1.5175474E-2,1.5249618E-2,2.5737155999999998E-4,6.0698491000000002E-4,8.3395737000000001E-3,4.4477209999999996,32.394359000000001,177.5968,6836.1279999999997,202.06880000000001,1.5073916999999999E-4,3.1036750999999998,1.2324101000000001,14.641643999999999,13.544537999999999,1484.3253]
["Human Health","Pt",0.45171065999999999,0.40990968,0.13229610999999999,3.4068716000000001,0.22548292,48.844056999999999,3.5052858000000002E-3,5.9537501000000003E-3,3.3493836999999999E-2,4.7080869000000001E-3,1.1843782000000001E-2,1.9744254999999999E-3,1.2475552999999999E-3,2.3252229999999999E-2,1.2469478000000001E-2,2.9764242E-5,1.4716055E-2,1.4703848E-2,1.4731408E-2,1.171763E-4,3.3655546E-4,8.2234021000000008E-3,4.0482680000000002,32.394359000000001,0,6161.4,0,8.3540069999999994E-5,1.5147964,0.53039241999999998,14.007887,8.1478163000000006,1482.8983000000001]
["Ecosystem Quality","Pt",2.1792175999999999,1.1434601,0.47802376000000002,6.6229693000000003,2.4662703000000001E-2,538.10388999999998,3.3057570999999998E-4,4.1410821999999999E-4,5.1107562999999998E-3,3.7523249999999998E-4,1.3366195E-3,3.1059723000000002E-4,1.0821953E-4,2.8284376999999999E-3,0,1.8321769999999999E-5,4.3892098999999998E-4,4.4386906999999999E-4,4.5008367000000003E-4,4.3949010999999999E-5,5.1014265999999997E-5,1.1617161E-4,0.39945296000000002,0,177.5968,674.72799999999995,202.06880000000001,8.0498861000000006E-6,0.21354198999999999,3.3995251999999997E-2,0.10073621000000001,1.6006203000000001,1.3684349]
["Resources","Pt",0.26613818,0.24930611999999999,8.8094770000000003E-2,2.4558046,0.18659967999999999,70.222776999999994,2.5500159E-3,1.6766575999999998E-2,1.7247387999999999E-2,1.5843548999999998E-2,1.0647545E-2,1.2063410000000001E-3,5.0979659999999996E-4,1.342048E-2,0,3.6504304E-5,2.2556707E-5,2.7757012000000002E-5,6.8126106000000001E-5,9.6246248999999994E-5,2.1941518E-4,0,0,0,0,0,0,5.9149216999999999E-5,1.3753367000000001,0.66802238999999997,0.53302073999999999,3.7961016000000001,5.8537514999999998E-2]
["Total","Pt",2.8666271000000001,1.790313,0.68384734999999996,8.9681536000000008,0.42675434000000001,645.46214999999995,7.7487103999999999E-3,2.3467775999999999E-2,5.1111431999999998E-2,1.8557409E-2,2.3465711E-2,3.3892198E-3,1.8397956E-3,4.1417308999999999E-2,1.2469478000000001E-2,5.7015292E-4,1.5182209E-2,1.5176817E-2,1.5247699E-2,2.5209095000000001E-4,5.9888221000000004E-4,8.3395737000000001E-3,4.4477209999999996,32.394359000000001,177.5968,6836.1279999999997,202.06880000000001,1.7827087000000001E-4,4.5447882000000002,1.1637668000000001,14.622802,19.091290000000001,1484.3269]
[null,null,{"$f":"C71=C67","v":false},{"$f":"D71=D67","v":false},false,false,false,false,false,false,false,false,false,null,null,false,true,false,false,false,false,false,false,true,true,true,true,true,true,false,false,false,false,false,false]
[]
[]
["Calculation: ","Compare"]
["Results: ","Impact assessment"]
["Product 1: ","1 m3 Wood chips, hardwood, u=80%, at forest/RER U (of project ESU database 2019)"]
["Product 2: ","1 m3 Wood chips, softwood, u=140%, at forest/RER U (of project ESU database 2019)"]
["Product 3: ","1 m3 Wood chips, mixed, from industry, u=40%, at plant/RER U (of project ESU database 2019)"]
["Product 4: ","1 m3 Wood pellets, u=10%, at storehouse/RER U (of project ESU database 2019)"]
["Product 5: ","1 m3 Waste wood chips, mixed, from industry, u=40%, at plant/CH U (of project ESU database 2019)"]
["Product 6: ","1000 kg Rape methyl ester, at regional storage/CH U (of project ESU database 2019)"]
["Product 7: ","1 kWh electricity, medium voltage, at grid/kWh/CH U (of project ESU database 2019)"]
["Product 8: ","3.6 MJ light fuel oil, burned in industrial furnace 1MW, non-modulating/MJ/CH U (of project ESU database 2019)"]
["Product 9: ","3.6 MJ Diesel, burned in building machine/GLO U (of project ESU database 2019)"]
["Product 10: ","3.6 MJ Natural gas, burned in boiler condensing modulating >100kW/RER U (of project ESU database 2019)"]
["Product 11: ","1 tkm Transport, lorry 20-28t, fleet average/CH U (of project ESU database 2019)"]
["Product 12: ","1 tkm Transport, freight, rail/RER U (of project ESU database 2019)"]
["Product 13: ","1 tkm Transport, transoceanic freight ship/OCE U (of project ESU database 2019)"]
["Product 14: ","1 tkm Transport, tractor and trailer/CH U (of project ESU database 2019)"]
["Product 15: ","1 kWh biogas, vented/CH U (of project 208 naturemade KWM)"]
["Product 16: ","1 kWh methane, 96 vol-%, purification and distribution/kWh/CH U (of project 208 naturemade KWM)"]
["Product 17: ","1 kWh wood chips combustion, burned in furnace/MJ/CH U (of project 208 naturemade KWM)"]
["Product 18: ","1 kWh wood chips combustion, burned in cogen 6400kWth/MJ/CH U (of project 208 naturemade KWM)"]
["Product 19: ","1 kWh wood chips combustion, burned in cogen ORC 1400kWth/MJ/CH U (of project 208 naturemade KWM)"]
["Product 20: ","1 kWh wood chips, gasified in cogen, fixed bed/MJ/KWM U (of project 208 naturemade KWM)"]
["Product 21: ","1 kWh wood chips, in fluidized bed gasification, with biomethane production/MJ/KWM U (of project 208 naturemade KWM)"]
["Product 22: ","1 m3 emission, gasification/m3/KWM U (of project 208 naturemade KWM)"]
["Product 23: ","1 kg emission, NOx/kg/CH U (of project 208 naturemade KWM)"]
["Product 24: ","1 kg emission, PM2.5/kg/CH U (of project 208 naturemade KWM)"]
["Product 25: ","1 kg emission, lead/kg/CH U (of project 208 naturemade KWM)"]
["Product 26: ","1 kg emission, cadmium/kg/CH U (of project 208 naturemade KWM)"]
["Product 27: ","1 kg emission, zinc/kg/CH U (of project 208 naturemade KWM)"]
["Product 28: ","1 kWh transport, district heat network, average/CH/I U (of project 208 naturemade KWM)"]
["Product 29: ","1000 kg disposal, wood ash mixture, pure, 0% water, to municipal incineration/kg/CH U (of project ESU database 2019)"]
["Product 30: ","1000 kg Disposal, inert waste, 5% water, to inert material landfill/CH U (of project ESU database 2019)"]
["Product 31: ","1 ton disposal, filter dust, wood, to residual material landfill/CH U (of project 208 naturemade KWM)"]
["Product 32: ","1000 kg Disposal, hazardous waste, 0% water, to underground deposit/DE U (of project ESU database 2019)"]
["Product 33: ","1000 kg Disposal, wood ash mixture, pure, 0% water, to landfarming/CH U (of project ESU database 2019)"]
["Method: ","IPCC 2013 GWP 100a V1.03"]
["Indicator: ","Characterisation"]
["Skip categories: ","Never"]
["Exclude infrastructure processes: ","No"]
["Exclude long-term emissions: ","No"]
["Sorted on item: ","Impact category"]
["Sort order: ","Ascending"]
[]
["Impact category","Unit","Wood chips, hardwood, u=80%, at forest/RER U","Wood chips, softwood, u=140%, at forest/RER U","Wood chips, mixed, from industry, u=40%, at plant/RER U","Wood pellets, u=10%, at storehouse/RER U","Waste wood chips, mixed, from industry, u=40%, at plant/CH U","Rape methyl ester, at regional storage/CH U","electricity, medium voltage, at grid/kWh/CH U","light fuel oil, burned in industrial furnace 1MW, non-modulating/MJ/CH U","Diesel, burned in building machine/GLO U","Natural gas, burned in boiler condensing modulating >100kW/RER U","Transport, lorry 20-28t, fleet average/CH U","Transport, freight, rail/RER U","Transport, transoceanic freight ship/OCE U","Transport, tractor and trailer/CH U","biogas, vented/CH U","methane, 96 vol-%, purification and distribution/kWh/CH U","wood chips combustion, burned in furnace/MJ/CH U","wood chips combustion, burned in cogen 6400kWth/MJ/CH U","wood chips combustion, burned in cogen ORC 1400kWth/MJ/CH U","wood chips, gasified in cogen, fixed bed/MJ/KWM U","wood chips, in fluidized bed gasification, with biomethane production/MJ/KWM U","emission, gasification/m3/KWM U","emission, NOx/kg/CH U","emission, PM2.5/kg/CH U","emission, lead/kg/CH U","emission, cadmium/kg/CH U","emission, zinc/kg/CH U","transport, district heat network, average/CH/I U","disposal, wood ash mixture, pure, 0% water, to municipal incineration/kg/CH U","Disposal, inert waste, 5% water, to inert material landfill/CH U","disposal, filter dust, wood, to residual material landfill/CH U","Disposal, hazardous waste, 0% water, to underground deposit/DE U","Disposal, wood ash mixture, pure, 0% water, to landfarming/CH U"]
["IPCC GWP 100a","kg CO2 eq",5.8387720999999999,5.5629663999999996,3.1319558000000001,76.349905000000007,4.8789094000000004,2950.3508000000002,0.10006507000000001,0.35143109,0.36946380000000001,0.29077821999999998,0.21062322999999999,4.0307163999999999E-2,1.1909972E-2,0.31196265000000001,1.9884818,1.7928E-3,3.4456117000000001E-3,2.9449889999999999E-3,3.6729678999999999E-3,3.2160295999999998E-3,6.4511059999999999E-3,3.4265207E-3,0,0,0,0,0,2.3231638999999999E-3,22.473794000000002,8.2993260000000006,34.475658000000003,185.79686000000001,1.2947744000000001]
["IPCC GWP 100a","kg CO2 eq",5.3815695999999997,5.2149711999999999,2.8853710000000001,95.001891999999998,4.4942538000000001,2325.6410999999998,0.12231567,0.3161735,0.32757449999999999,0.24585672,0.19252105999999999,3.7303157000000003E-2,1.0529761E-2,0.30231928000000002,1.576454,4.4425306999999997E-2,3.6857659E-3,3.1564789000000002E-3,3.786326E-3,2.916723E-3,5.9570665000000002E-3,3.1363595999999998E-3,0,0,0,0,0,2.5531967E-3,22.216926000000001,7.0452516999999997,33.581522999999997,178.28671,1.1958507]
[]
["Calculation: ","Compare"]
["Results: ","Impact assessment"]
["Product 1: ","1 m3 Wood chips, hardwood, u=80%, at forest/RER U (of project ESU database 2019)"]
["Product 2: ","1 m3 Wood chips, softwood, u=140%, at forest/RER U (of project ESU database 2019)"]
["Product 3: ","1 m3 Wood chips, mixed, from industry, u=40%, at plant/RER U (of project ESU database 2019)"]
["Product 4: ","1 m3 Wood pellets, u=10%, at storehouse/RER U (of project ESU database 2019)"]
["Product 5: ","1 m3 Waste wood chips, mixed, from industry, u=40%, at plant/CH U (of project ESU database 2019)"]
["Product 6: ","1000 kg Rape methyl ester, at regional storage/CH U (of project ESU database 2019)"]
["Product 7: ","1 kWh electricity, medium voltage, at grid/kWh/CH U (of project ESU database 2019)"]
["Product 8: ","3.6 MJ light fuel oil, burned in industrial furnace 1MW, non-modulating/MJ/CH U (of project ESU database 2019)"]
["Product 9: ","3.6 MJ Diesel, burned in building machine/GLO U (of project ESU database 2019)"]
["Product 10: ","3.6 MJ Natural gas, burned in boiler condensing modulating >100kW/RER U (of project ESU database 2019)"]
["Product 11: ","1 tkm Transport, lorry 20-28t, fleet average/CH U (of project ESU database 2019)"]
["Product 12: ","1 tkm Transport, freight, rail/RER U (of project ESU database 2019)"]
["Product 13: ","1 tkm Transport, transoceanic freight ship/OCE U (of project ESU database 2019)"]
["Product 14: ","1 tkm Transport, tractor and trailer/CH U (of project ESU database 2019)"]
["Product 15: ","1 kWh biogas, vented/CH U (of project 208 naturemade KWM)"]
["Product 16: ","1 kWh methane, 96 vol-%, purification and distribution/kWh/CH U (of project 208 naturemade KWM)"]
["Product 17: ","1 kWh wood chips combustion, burned in furnace/MJ/CH U (of project 208 naturemade KWM)"]
["Product 18: ","1 kWh wood chips combustion, burned in cogen 6400kWth/MJ/CH U (of project 208 naturemade KWM)"]
["Product 19: ","1 kWh wood chips combustion, burned in cogen ORC 1400kWth/MJ/CH U (of project 208 naturemade KWM)"]
["Product 20: ","1 kWh wood chips, gasified in cogen, fixed bed/MJ/KWM U (of project 208 naturemade KWM)"]
["Product 21: ","1 kWh wood chips, in fluidized bed gasification, with biomethane production/MJ/KWM U (of project 208 naturemade KWM)"]
["Product 22: ","1 m3 emission, gasification/m3/KWM U (of project 208 naturemade KWM)"]
["Product 23: ","1 kg emission, NOx/kg/CH U (of project 208 naturemade KWM)"]
["Product 24: ","1 kg emission, PM2.5/kg/CH U (of project 208 naturemade KWM)"]
["Product 25: ","1 kg emission, lead/kg/CH U (of project 208 naturemade KWM)"]
["Product 26: ","1 kg emission, cadmium/kg/CH U (of project 208 naturemade KWM)"]
["Product 27: ","1 kg emission, zinc/kg/CH U (of project 208 naturemade KWM)"]
["Product 28: ","1 kWh transport, district heat network, average/CH/I U (of project 208 naturemade KWM)"]
["Product 29: ","1000 kg disposal, wood ash mixture, pure, 0% water, to municipal incineration/kg/CH U (of project ESU database 2019)"]
["Product 30: ","1000 kg Disposal, inert waste, 5% water, to inert material landfill/CH U (of project ESU database 2019)"]
["Product 31: ","1 ton disposal, filter dust, wood, to residual material landfill/CH U (of project 208 naturemade KWM)"]
["Product 32: ","1000 kg Disposal, hazardous waste, 0% water, to underground deposit/DE U (of project ESU database 2019)"]
["Product 33: ","1000 kg Disposal, wood ash mixture, pure, 0% water, to landfarming/CH U (of project ESU database 2019)"]
["Method: ","Cumulative Energy Demand, differenziert V1.04 / CED, non-renewable"]
["Indicator: ","Single score"]
["Skip categories: ","With result = 0"]
["Default units: ","Yes"]
["Exclude infrastructure processes: ","No"]
["Exclude long-term emissions: ","No"]
["Sorted on item: ","Impact category"]
["Sort order: ","Ascending"]
[]
["Impact category","Unit","Wood chips, hardwood, u=80%, at forest/RER U","Wood chips, softwood, u=140%, at forest/RER U","Wood chips, mixed, from industry, u=40%, at plant/RER U","Wood pellets, u=10%, at storehouse/RER U","Waste wood chips, mixed, from industry, u=40%, at plant/CH U","Rape methyl ester, at regional storage/CH U","electricity, medium voltage, at grid/kWh/CH U","light fuel oil, burned in industrial furnace 1MW, non-modulating/MJ/CH U","Diesel, burned in building machine/GLO U","Natural gas, burned in boiler condensing modulating >100kW/RER U","Transport, lorry 20-28t, fleet average/CH U","Transport, freight, rail/RER U","Transport, transoceanic freight ship/OCE U","Transport, tractor and trailer/CH U","biogas, vented/CH U","methane, 96 vol-%, purification and distribution/kWh/CH U","wood chips combustion, burned in furnace/MJ/CH U","wood chips combustion, burned in cogen 6400kWth/MJ/CH U","wood chips combustion, burned in cogen ORC 1400kWth/MJ/CH U","wood chips, gasified in cogen, fixed bed/MJ/KWM U","wood chips, in fluidized bed gasification, with biomethane production/MJ/KWM U","emission, gasification/m3/KWM U","emission, NOx/kg/CH U","emission, PM2.5/kg/CH U","emission, lead/kg/CH U","emission, cadmium/kg/CH U","emission, zinc/kg/CH U","transport, district heat network, average/CH/I U","disposal, wood ash mixture, pure, 0% water, to municipal incineration/kg/CH U","Disposal, inert waste, 5% water, to inert material landfill/CH U","disposal, filter dust, wood, to residual material landfill/CH U","Disposal, hazardous waste, 0% water, to underground deposit/DE U","Disposal, wood ash mixture, pure, 0% water, to landfarming/CH U"]
["Total","MJ",89.737092000000004,87.197652000000005,56.89,1411.2125000000001,82.831785999999994,24862.699000000001,8.5752348000000005,4.8248894,5.0808019,4.5956640000000002,3.2671201999999999,0.68727861999999995,0.16732973000000001,4.8039607999999996,0,1.2260287999999999E-2,1.0584147E-2,9.7390522000000007E-3,2.2280114E-2,3.2378751999999997E-2,0.11329496999999999,0,0,0,0,0,0,0.1210212,432.43804,199.36283,219.93826000000001,2824.8130000000001,19.630457]
["Non renewable, fossil","MJ",81.171767000000003,77.562983000000003,39.675469,1016.7414,66.301150000000007,20735.850999999999,1.2030871999999999,4.7169011999999997,4.9526776999999997,4.5355027999999997,3.0887411999999999,0.49923074000000001,0.1544026,4.1951603000000004,0,1.1624455000000001E-2,8.5743929E-3,8.7912866999999995E-3,2.0634497000000002E-2,2.9733487999999999E-2,8.2560898999999993E-2,0,0,0,0,0,0,2.7018088999999999E-2,408.27059000000003,190.89111,186.23522,2637.6615999999999,17.789853000000001]
["Non-renewable, nuclear","MJ",8.4000809000000007,9.4946376000000008,17.190355,394.06759,16.522099000000001,4124.0618000000004,7.3720432000000002,0.10779902,0.11442363,5.9817209000000003E-2,0.17786097000000001,0.18765209999999999,1.2919164E-2,0.60824871000000003,0,6.3193007999999995E-4,2.0072082E-3,9.4355915000000001E-4,1.6397719E-3,2.6040397000000001E-3,3.0716573E-2,0,0,0,0,0,0,9.3996250000000003E-2,23.988502,8.3364975999999995,33.657477999999998,186.84549999999999,1.8379863999999999]
["Non-renewable, land transformation","MJ",0.16524425000000001,0.14003151999999999,2.4176348E-2,0.40348129999999999,8.5373402000000001E-3,2.7854405999999998,1.0440088E-4,1.8914518999999999E-4,1.3700552E-2,3.4390811000000002E-4,5.1793971000000001E-4,3.9578015999999999E-4,7.9705659999999999E-6,5.5185097999999998E-4,0,3.9033796000000003E-6,2.5460332E-6,4.2064149000000003E-6,5.8445433999999996E-6,4.1224294999999997E-5,1.7497171999999999E-5,0,0,0,0,0,0,6.8630375000000003E-6,0.17894076,0.1352208,4.5562598000000003E-2,0.30590792999999999,2.6175928E-3]
["Total","MJ",88.004527999999993,86.210635999999994,55.130293000000002,1868.0571,80.652977000000007,23723.041000000001,8.7182899000000003,4.6040694999999996,4.8782641,4.2853539999999999,3.1951896999999998,0.66760931999999995,0.16229988000000001,4.8042224999999998,0,1.1581746E-2,1.0519278999999999E-2,9.4431871999999997E-3,2.1387005000000001E-2,3.1497769000000002E-2,0.11011559,0,0,0,0,0,0,0.1226098,444.4434,195.49026000000001,220.27778000000001,2796.9618999999998,19.157644999999999]
[]
[]
["Calculation: ","Compare"]
["Results: ","Impact assessment"]
["Product 1: ","1 m3 Wood chips, hardwood, u=80%, at forest/RER U (of project ESU database 2019)"]
["Product 2: ","1 m3 Wood chips, softwood, u=140%, at forest/RER U (of project ESU database 2019)"]
["Product 3: ","1 m3 Wood chips, mixed, from industry, u=40%, at plant/RER U (of project ESU database 2019)"]
["Product 4: ","1 m3 Wood pellets, u=10%, at storehouse/RER U (of project ESU database 2019)"]
["Product 5: ","1 m3 Waste wood chips, mixed, from industry, u=40%, at plant/CH U (of project ESU database 2019)"]
["Product 6: ","1000 kg Rape methyl ester, at regional storage/CH U (of project ESU database 2019)"]
["Product 7: ","1 kWh electricity, medium voltage, at grid/kWh/CH U (of project ESU database 2019)"]
["Product 8: ","3.6 MJ light fuel oil, burned in industrial furnace 1MW, non-modulating/MJ/CH U (of project ESU database 2019)"]
["Product 9: ","3.6 MJ Diesel, burned in building machine/GLO U (of project ESU database 2019)"]
["Product 10: ","3.6 MJ Natural gas, burned in boiler condensing modulating >100kW/RER U (of project ESU database 2019)"]
["Product 11: ","1 tkm Transport, lorry 20-28t, fleet average/CH U (of project ESU database 2019)"]
["Product 12: ","1 tkm Transport, freight, rail/RER U (of project ESU database 2019)"]
["Product 13: ","1 tkm Transport, transoceanic freight ship/OCE U (of project ESU database 2019)"]
["Product 14: ","1 tkm Transport, tractor and trailer/CH U (of project ESU database 2019)"]
["Product 15: ","1 kWh biogas, vented/CH U (of project 208 naturemade KWM)"]
["Product 16: ","1 kWh methane, 96 vol-%, purification and distribution/kWh/CH U (of project 208 naturemade KWM)"]
["Product 17: ","1 kWh wood chips combustion, burned in furnace/MJ/CH U (of project 208 naturemade KWM)"]
["Product 18: ","1 kWh wood chips combustion, burned in cogen 6400kWth/MJ/CH U (of project 208 naturemade KWM)"]
["Product 19: ","1 kWh wood chips combustion, burned in cogen ORC 1400kWth/MJ/CH U (of project 208 naturemade KWM)"]
["Product 20: ","1 kWh wood chips, gasified in cogen, fixed bed/MJ/KWM U (of project 208 naturemade KWM)"]
["Product 21: ","1 kWh wood chips, in fluidized bed gasification, with biomethane production/MJ/KWM U (of project 208 naturemade KWM)"]
["Product 22: ","1 m3 emission, gasification/m3/KWM U (of project 208 naturemade KWM)"]
["Product 23: ","1 kg emission, NOx/kg/CH U (of project 208 naturemade KWM)"]
["Product 24: ","1 kg emission, PM2.5/kg/CH U (of project 208 naturemade KWM)"]
["Product 25: ","1 kg emission, lead/kg/CH U (of project 208 naturemade KWM)"]
["Product 26: ","1 kg emission, cadmium/kg/CH U (of project 208 naturemade KWM)"]
["Product 27: ","1 kg emission, zinc/kg/CH U (of project 208 naturemade KWM)"]
["Product 28: ","1 kWh transport, district heat network, average/CH/I U (of project 208 naturemade KWM)"]
["Product 29: ","1000 kg disposal, wood ash mixture, pure, 0% water, to municipal incineration/kg/CH U (of project ESU database 2019)"]
["Product 30: ","1000 kg Disposal, inert waste, 5% water, to inert material landfill/CH U (of project ESU database 2019)"]
["Product 31: ","1 ton disposal, filter dust, wood, to residual material landfill/CH U (of project 208 naturemade KWM)"]
["Product 32: ","1000 kg Disposal, hazardous waste, 0% water, to underground deposit/DE U (of project ESU database 2019)"]
["Product 33: ","1000 kg Disposal, wood ash mixture, pure, 0% water, to landfarming/CH U (of project ESU database 2019)"]
["Method: ","Ecological Scarcity 2013, categories, res. cor. V1.03 / Ecological scarcity 2013"]
["Indicator: ","Single score"]
["Skip categories: ","Never"]
["Default units: ","Yes"]
["Exclude infrastructure processes: ","No"]
["Exclude long-term emissions: ","No"]
["Sorted on item: ","Impact category"]
["Sort order: ","Ascending"]
[]
["Impact category","Unit","Wood chips, hardwood, u=80%, at forest/RER U","Wood chips, softwood, u=140%, at forest/RER U","Wood chips, mixed, from industry, u=40%, at plant/RER U","Wood pellets, u=10%, at storehouse/RER U","Waste wood chips, mixed, from industry, u=40%, at plant/CH U","Rape methyl ester, at regional storage/CH U","electricity, medium voltage, at grid/kWh/CH U","light fuel oil, burned in industrial furnace 1MW, non-modulating/MJ/CH U","Diesel, burned in building machine/GLO U","Natural gas, burned in boiler condensing modulating >100kW/RER U","Transport, lorry 20-28t, fleet average/CH U","Transport, freight, rail/RER U","Transport, transoceanic freight ship/OCE U","Transport, tractor and trailer/CH U","biogas, vented/CH U","methane, 96 vol-%, purification and distribution/kWh/CH U","wood chips combustion, burned in furnace/MJ/CH U","wood chips combustion, burned in cogen 6400kWth/MJ/CH U","wood chips combustion, burned in cogen ORC 1400kWth/MJ/CH U","wood chips, gasified in cogen, fixed bed/MJ/KWM U","wood chips, in fluidized bed gasification, with biomethane production/MJ/KWM U","emission, gasification/m3/KWM U","emission, NOx/kg/CH U","emission, PM2.5/kg/CH U","emission, lead/kg/CH U","emission, cadmium/kg/CH U","emission, zinc/kg/CH U","transport, district heat network, average/CH/I U","disposal, wood ash mixture, pure, 0% water, to municipal incineration/kg/CH U","Disposal, inert waste, 5% water, to inert material landfill/CH U","disposal, filter dust, wood, to residual material landfill/CH U","Disposal, hazardous waste, 0% water, to underground deposit/DE U","Disposal, wood ash mixture, pure, 0% water, to landfarming/CH U"]
["Total","Pt",22014.554,16200.785,9682.1596000000009,133344.48000000001,6187.3365999999996,10723471,310.50968999999998,248.6018,501.39366999999999,195.18025,293.32083,66.493983,18.180146000000001,475.93329,859.92828999999995,1.329755,96.394575000000003,95.853528999999995,96.652946,3.9217335000000002,9.5963027000000007,46.101135999999997,39000,140000,22000000,460000000,5600000,5.3876822000000004,100507.6,14928.615,94408.019,27122060,11990537]
["Water resources","Pt",26.851012000000001,24.403863999999999,8.6669172000000003,206.54062999999999,19.165707000000001,4361.7718999999997,0.59390052999999998,1.7708743,1.7101681,7.8514760000000003E-2,1.1168224,0.11991110000000001,5.1611075999999999E-2,1.3176806000000001,0,1.2029132E-3,2.7273669E-3,2.0798608000000001E-3,3.5755359999999998E-3,9.6226056000000004E-3,2.4223114E-2,0,0,0,0,0,0,9.8460544999999997E-3,144.06057000000001,75.244027000000003,66.258945999999995,261.47561999999999,5.7319513999999998]
["Energy resources","Pt",5480.2834999999995,4103.1944999999996,4367.8692000000001,19771.994999999999,289.44558000000001,147203.9,30.766793,16.820218000000001,17.920183000000002,15.637549999999999,11.400285999999999,2.4110111000000001,0.58355358000000002,17.006398000000001,0,4.2111415999999999E-2,3.7087888999999999E-2,3.5506617999999997E-2,7.9071536999999997E-2,0.14715838000000001,0.41065895000000002,0,0,0,0,0,0,0.43263328000000001,1509.5585000000001,697.15418,770.05772999999999,10247.364,68.948445000000007]
["Mineral resources","Pt",610.42701999999997,375.54273000000001,150.28594000000001,1801.9619,145.00058000000001,35462.186999999998,1.5792846,2.3846023999999999,3.2103842999999999,3.5330441000000001,9.0054704999999995,2.5241166000000002,8.4353475999999997E-2,9.8557103999999995,0,9.8535342999999997E-2,0.22599016999999999,8.3734034999999998E-2,0.11592049,0.15839128999999999,0.64432034999999999,0,0,0,0,0,0,0.12386944,5456.0585000000001,3494.6770999999999,1431.6316999999999,4429.3283000000001,48.245818]
["Land use","Pt",8104.7891,4175.5973999999997,1775.8456000000001,24572.955000000002,24.616637000000001,2286406.6,0.30319655000000001,0.34258937,7.6013869999999999,0.26079640999999998,0.97430039999999996,0.53943657,2.3909413000000001E-2,4.1902412,0,6.6227418999999996E-3,3.5838535999999997E-2,5.7851756999999997E-2,7.2158413000000005E-2,0.10881583,7.0052724999999996E-2,0,0,0,0,0,0,9.1017817000000004E-3,939.55862000000002,403.57785000000001,367.8,4561.8063000000002,11.196918]
["Global warming","Pt",2701.3587000000002,2586.1797999999999,1440.8331000000001,34972.305,2227.4173999999998,1438917.6,45.516046000000003,160.11062999999999,169.51330999999999,131.8058,96.210121000000001,18.44707,5.4438773999999999,142.84676999999999,859.88400000000001,0.79312221999999999,1.7393502999999999,1.5017739999999999,1.8324943,1.4641534,2.9389840999999999,1.5990308,0,0,0,0,0,1.0622978000000001,10248.873,3769.9128999999998,15794.121999999999,86449.510999999999,592.84123]
["Ozone layer depletion","Pt",1.1444726999999999,1.1466494,0.88314185000000001,20.743434000000001,1.1202388000000001,1873.9893,0.35682536999999998,4.4469605000000002E-2,4.8259917999999999E-2,0.18609738000000001,3.5160195999999998E-2,1.0415285999999999E-2,1.6174352E-3,7.7622087000000006E-2,0,4.1654144000000001E-4,1.6385600000000001E-4,1.8758935000000001E-4,5.3787145000000003E-4,5.7587055E-4,1.8754677E-3,0,0,0,0,0,0,4.8119692999999998E-3,4.2299142999999999,1.9404777,2.9064542000000002,17.391209,0.26910849999999997]
["Main air pollutants and PM","Pt",3204.8220999999999,2972.424,848.57583,19584.274000000001,1494.8155999999999,1299420.1000000001,19.888646000000001,27.111083000000001,231.86792,20.483494,86.703142999999997,12.662756,9.9271916000000004,141.67366000000001,4.4288399999999999E-2,0.11956124,72.758933999999996,72.705288999999993,72.865933999999996,0.58531451999999995,2.0685625000000001,40.608133000000002,39000,140000,0,0,0,0.44611537000000001,9671.3655999999992,3767.5987,4356.9387999999999,42328.663,658.98932000000002]
["Carcinogenic substances into air","Pt",256.61815999999999,291.13499999999999,78.653505999999993,2116.2237,125.30632,36240.595999999998,1.9662474000000001,1.6263472000000001,5.8402441999999999,4.4574217000000003,4.8339211000000004,2.0852843999999999,0.42237992000000002,18.103563999999999,0,6.2296691000000001E-2,11.833105,11.770488,11.802047999999999,0.2386935,0.62978847999999998,0.36806288999999998,0,0,0,0,0,0.21559322,8936.7692999999999,157.68403000000001,2657.5373,54026.163999999997,72.334969000000001]
["Heavy metals into air","Pt",325.91322000000002,392.79685999999998,134.95197999999999,2711.7046,154.86115000000001,76920.297000000006,9.0397014999999996,2.0291036999999998,4.7775929000000001,2.5400906000000001,6.0934179999999998,2.0812564999999998,0.18519652,22.260560999999999,0,6.1437866000000001E-2,9.5484009000000007,9.5416302000000002,9.6266035999999993,0.29733998,0.57997611999999998,3.5259092000000001,0,0,22000000,460000000,5600000,0.23146233999999999,880.60985000000005,182.65019000000001,694.83708999999999,14686.796,111.57474999999999]
["Water pollutants","Pt",343.12268,335.16764000000001,72.967417999999995,7017.8849,120.19605,3426864.3,0.84526405999999998,10.659362,21.646218000000001,1.3361575999999999,8.0024739999999994,0.84480518000000004,0.27441955000000001,9.9195142000000001,0,7.9189406000000004E-3,1.5639294000000001E-2,2.1496033000000001E-2,3.5879183000000002E-2,9.2592067E-2,0.43945997999999997,0,0,0,0,0,0,2.3512492999999999E-2,1502.8108,494.51459999999997,918.43195000000003,2161.6768999999999,42.805452000000002]
["POP into water","Pt",103.13652999999999,93.406580000000005,19.247886999999999,451.19083000000001,60.930846000000003,21096.530999999999,0.2108284,7.0368037000000001,7.4399468999999998,0.19384784999999999,4.3255486999999997,0.31755948000000001,0.21544522999999999,4.6667831,0,2.4836760999999998E-3,6.4342486000000003E-3,5.7831832E-3,1.0754067000000001E-2,3.1750291999999999E-2,0.12696755000000001,0,0,0,0,0,0,6.8874017000000003E-3,520.82106999999996,279.15615000000003,200.76365999999999,516.80028000000004,21.643922]
["Heavy metals into water","Pt",413.20073000000002,406.51197000000002,140.38207,3177.9892,434.00112999999999,275477.3,4.0951370000000002,14.719685,19.852618,12.179394,19.004802000000002,2.8154819,0.50327752999999997,20.647258999999998,0,0.10338984,0.10921288,8.5172044000000002E-2,0.13538571999999999,0.61471385999999995,0.47757581999999998,0,0,0,0,0,0,0.30645315000000001,7334.1403,741.83735999999999,54166.667999999998,18073.075000000001,77.426331000000005]
["Pesticides into soil","Pt",41.021044000000003,37.856332999999999,7.5275825999999997,332.96199999999999,1.8514147999999999,526608.01,2.1816240000000001E-2,4.0057210000000003E-2,2.9980506,6.3997368999999998E-2,0.11413371,8.6779428000000006E-2,1.7416688000000001E-3,0.13205876,0,6.2226111999999999E-4,5.5353666000000005E-4,9.8957667999999993E-4,1.3463123E-3,8.8383006999999993E-3,4.6708078000000002E-3,0,0,0,0,0,0,8.5787063000000003E-4,39.206271000000001,29.564999,9.9514908000000002,128.46784,119600.6]
["Heavy metals into soil","Pt",34.570613000000002,31.735568000000001,12.762403000000001,1265.8223,45.652363000000001,996351.76,0.90167721999999995,6.8979024999999999E-2,2.1409269000000002,6.7347298E-2,3.1708704000000001,8.7050573000000006E-2,5.3661222999999997E-3,61.855525999999998,0,7.9829654999999996E-4,1.9549055E-3,2.2793542E-3,3.0915665000000002E-3,9.4018438000000003E-3,5.8083098999999999E-2,0,0,0,0,0,0,1.2557446E-2,210.76965999999999,64.196414000000004,42.162238000000002,229.27474000000001,11869165]
["Radioactive substances into air","Pt",7.1089125999999994E-5,8.0437917999999994E-5,1.3590166E-4,3.0248736000000002E-3,1.3187509000000001E-4,3.6529010000000001E-2,6.7016815000000006E-5,9.2444992000000002E-7,9.0519948999999998E-7,4.6412645999999998E-7,1.5255095999999999E-6,1.5122302999999999E-6,1.0173228E-7,5.2063367000000002E-6,0,4.7376070999999996E-9,1.7619699999999999E-8,7.4453145E-9,1.2679683E-8,2.1349645999999999E-8,2.4192673999999998E-7,0,0,0,0,0,0,8.5170218E-7,1.8529302E-4,6.7420912000000003E-5,2.9964910000000001E-4,1.22218E-3,1.5988703E-5]
["Radioactive substances into water","Pt",6.8133020999999996,7.6679975000000002,17.717110999999999,391.73653000000002,16.546026000000001,3023.5938000000001,4.9118611999999997,8.6800027000000002E-2,0.11511950999999999,5.8566048000000002E-2,0.13834128000000001,0.18440639,1.3386274E-2,0.47417056000000002,0,5.6584531E-4,1.5177680000000001E-3,8.0395079999999995E-4,1.4428808E-3,2.3528805000000001E-3,3.1254863000000001E-2,0,0,0,0,0,0,6.2858315999999997E-2,17.751476,6.3629921999999999,23.395533,153.02422000000001,1.3673177000000001]
["Noise","Pt",94.451721000000006,60.953136999999998,47.354695999999997,2562.1976,494.36853000000002,34770.612999999998,0.26285644000000002,0.59641776000000002,0.77839276000000002,0.23065828999999999,37.061779000000001,15.30261,1.8598679E-2,1.6703558000000001,0,5.8113278000000001E-3,2.0248790999999999E-2,8.8021659000000006E-3,1.5157097E-2,2.4788248999999998E-2,9.0567390999999997E-2,0,0,0,0,0,0,1.8847856999999999E-2,2217.7963,531.14377000000002,460.54097999999999,2553.1206000000002,5.7382881000000001]
["Non radioactive waste to deposit","Pt",29.360361999999999,37.943069000000001,3.6857745999999998,100.1743,8.7435951999999997,2195.3742999999999,0.15860292000000001,0.12313657,0.30866070000000001,0.19253725999999999,0.24568564000000001,8.9623666000000005E-2,6.6352384999999996E-3,2.4408865999999998,0,4.6747541000000002E-3,2.7939521000000002E-3,2.9782050999999999E-3,4.4445435999999998E-3,4.9588133E-2,1.9299500000000001E-2,0,0,0,0,0,0,7.3841367000000002E-3,50258.671000000002,9.8317137999999993,11567.227000000001,26876381,3.0665947]
["Radioactive waste to deposit","Pt",236.66945999999999,267.12198000000001,553.94929000000002,12285.812,523.29733999999996,110276.45,189.09093999999999,3.030646,3.6242793999999998,1.8749298000000001,4.8845457999999997,5.8844076000000003,0.41758563999999998,16.794523000000002,0,1.8183118000000002E-2,5.4621938000000002E-2,2.6682913999999999E-2,4.7100535999999998E-2,7.7642463999999994E-2,0.97998160999999995,0,0,0,0,0,0,2.4125914000000002,614.54426000000001,221.56761,876.78759000000002,4855.1589000000004,49.382122000000003]
[]
["Total","Pt",16914.298999999999,13201.834000000001,8385.5151000000005,117176.06,4967.9120000000003,9356296.5999999996,365.89765999999997,178.60033999999999,405.15652,114.3998,211.37960000000001,45.718671000000001,17.729651,435.99077999999997,508.82828999999998,16.553920999999999,108.51376999999999,108.07302,108.68934,3.1685639999999999,8.1226292000000004,49.435279000000001,45000,150000,27000000,460000000,4400000,5.8962070999999998,480936.79,11482.392,64496.250999999997,27122600,13185705]

{"sheet":"Prüfwert","index":6,"n_rows":83,"n_cols":17,"rows_kept":83,"cut":false,"hidden":true,"merged":[]}
["Referenz",null,53,52,51,91,88,null,null,54,90,101,null,89,63]
[null,null,{"$f":"INDEX(menues!$1:$1048576,C1,sprache)","v":"Grenzwert Methan"},{"$f":"INDEX(menues!$1:$1048576,D1,sprache)","v":"Grenzwert Wärme"},{"$f":"INDEX(menues!$1:$1048576,E1,sprache)","v":"Grenzwert Strom"},{"$f":"INDEX(menues!$1:$1048576,F1,sprache)","v":"Grenzwert Kälte"},{"$f":"INDEX(menues!$1:$1048576,G1,sprache)","v":"Referenz Güllelager"},null,null,{"$f":"INDEX(menues!$1:$1048576,J1,sprache)","v":"Referenz Entsorgung"},{"$f":"INDEX(menues!$1:$1048576,K1,sprache)","v":"Referenz Frischklärschlamm"},{"$f":"INDEX(menues!$1:$1048576,L1,sprache)","v":0},null,{"$f":"INDEX(menues!$1:$1048576,N1,sprache)","v":"Referenz Kompost"},{"$f":"INDEX(menues!$1:$1048576,O1,sprache)","v":"Referenz direkte Emissionen"}]
["Zeile",null,16,62,14]
["Eingabe 1",null,{"$f":"INDEX(Prüfung!$1:$1048576,MATCH(C$3,Prüfung!$A:$A,0),3)","v":0},{"$f":"INDEX(Prüfung!$1:$1048576,MATCH(D$3,Prüfung!$A:$A,0),3)","v":0},{"$f":"INDEX(Prüfung!$1:$1048576,MATCH(E$3,Prüfung!$A:$A,0),3)","v":0}]
["Eingabe 2",null,null,{"$f":"INDEX(Prüfung!$1:$1048576,MATCH(D$3,Prüfung!$A:$A,0),4)","v":0},{"$f":"INDEX(Prüfung!$1:$1048576,MATCH(E$3,Prüfung!$A:$A,0),4)","v":0}]
["Eingabe 3",null,null,{"$f":"INDEX(Prüfung!$1:$1048576,MATCH(D$3,Prüfung!$A:$A,0),5)","v":{"$error":"#DIV/0!"}},{"$f":"INDEX(Prüfung!$1:$1048576,MATCH(E$3,Prüfung!$A:$A,0),5)","v":{"$error":"#DIV/0!"}}]
["Eingabe 4",null,null,{"$f":"INDEX(Prüfung!$1:$1048576,MATCH(D$3,Prüfung!$A:$A,0),6)","v":0},{"$f":"INDEX(Prüfung!$1:$1048576,MATCH(E$3,Prüfung!$A:$A,0),6)","v":0}]
["Umrechnungsfaktor",null,{"$f":"C4","v":0},{"$f":"D4","v":0},{"$f":"E4","v":0}]
["Direkte Emissionen"]
["Eco-indicator",{"$f":"SUM(C10:K10)","v":0},{"$f":"C8*C45+C9","v":0},{"$f":"D8*D45","v":0},{"$f":"E8*E45+E9","v":0},{"$f":"F8*F45+F9","v":0}]
[]
[]
[]
[]
[]
[]
["Calculation: ","Compare"]
["Results: ","Impact assessment"]
["Product 1: ","1 kWh threshold value, methane/kWh/CH U (of project 208 naturemade KWM)"]
["Product 2: ","1 kWh threshold value, methane/kWh/CH U (of project 208 naturemade KWM)"]
["Product 3: ","1 kWh threshold value, heat/kWh/CH U (of project 208 naturemade KWM)"]
["Product 4: ","1 kWh threshold value, electricity/kWh/CH U (of project 208 naturemade KWM)"]
["Product 5: ","1 kWh threshold value, cooling/kWh/CH U (of project 208 naturemade KWM)"]
["Product 6: ","1 kg reference value, manure/kg/CH U (of project 208 naturemade KWM)"]
["Product 7: ","1 kg reference value, digested matter, solid/kg/CH U (of project 208 naturemade KWM)"]
["Product 8: ","1 kg reference value, digested matter, liquid/kg/CH U (of project 208 naturemade KWM)"]
["Product 9: ","1 CHF reference value, co-substrate disposal/CHF/CH U (of project 208 naturemade KWM)"]
["Product 10: ","1 kg reference value, raw sewage sludge treatment/kg/CH U (of project 208 naturemade KWM)"]
["Product 11: ","1 kg reference value, fuel from digester sludge/kg/CH U (of project 208 naturemade KWM)"]
["Product 12: ","1 kg reference value, manure/kg/DE U (of project 208 naturemade KWM)"]
["Product 13: ","1 kg reference value, manure/kg/HU U (of project 208 naturemade KWM)"]
["Product 14: ","1 kg reference value, manure/kg/DK U (of project 208 naturemade KWM)"]
["Product 15: ","1 m3 reference value, paper production effluent/kg/CH U (of project 208 naturemade KWM)"]
["Method: ","Eco-indicator 99 (H) V2.10 / Europe EI 99 H/A"]
["Indicator: ","Single score"]
["Skip categories: ","Never"]
["Default units: ","Yes"]
["Exclude infrastructure processes: ","No"]
["Exclude long-term emissions: ","Yes"]
["Per impact category: ","No"]
["Sorted on item: ","Damage category"]
["Sort order: ","Ascending"]
[]
["Damage category","Unit","threshold value, methane/kWh/CH U","threshold value, methane/kWh/CH U","threshold value, heat/kWh/CH U","threshold value, electricity/kWh/CH U","threshold value, cooling/kWh/CH U","reference value, manure/kg/CH U","reference value, digested matter, solid/kg/CH U","reference value, digested matter, liquid/kg/CH U","reference value, co-substrate disposal/CHF/CH U","reference value, raw sewage sludge treatment/kg/CH U","reference value, fuel from digester sludge/kg/CH U","reference value, manure/kg/DE U","reference value, manure/kg/HU U","reference value, manure/kg/DK U","reference value, paper production effluent/kg/CH U"]
["Total","Pt",1.0615247E-2,1.0615247E-2,1.0254166E-2,1.8939705000000001E-2,2.6524347999999998E-3,2.9690546000000001E-6,1.1745254E-3,2.7867030000000001E-4,4.3643033999999997E-2,7.5140368999999999E-3,3.0687888E-2,1.0349681999999999E-5,1.1160245E-5,7.7693312E-6,7.3894570000000007E-2]
["Human Health","Pt",2.3865811000000001E-3,2.3865811000000001E-3,2.3069625999999998E-3,4.5706603000000004E-3,1.5038921E-3,2.0504767999999998E-6,7.9366790000000005E-4,1.8830727E-4,2.9491124000000001E-2,5.2972371999999998E-3,7.3315352000000002E-3,7.6195540999999998E-6,8.0482511999999997E-6,5.1036220999999998E-6,4.3378513E-2]
["Ecosystem Quality","Pt",2.1494347000000001E-4,2.1494347000000001E-4,1.8386393000000001E-4,4.1381049000000002E-4,4.0447279E-4,3.5667301999999997E-7,1.3529079E-4,3.2099369000000002E-5,5.0271372000000002E-3,3.7705866999999997E-4,6.4040967999999998E-4,8.8438826999999996E-7,7.5358139000000002E-7,1.0103324000000001E-6,6.4220084999999996E-3]
["Resources","Pt",8.0137226999999998E-3,8.0137226999999998E-3,7.7633390000000002E-3,1.3955235E-2,7.4406994999999998E-4,5.6190480000000002E-7,2.4556676000000001E-4,5.826367E-5,9.1247732999999998E-3,1.839741E-3,2.2715942999999999E-2,1.8457393E-6,2.3584127000000001E-6,1.6553766000000001E-6,2.4094048E-2]
[]
["Summe","Pt",7.7681508E-3,7.6644577000000002E-3,1.3690575999999999E-2,1.3526650000000001E-3,3.5528622E-6,8.0076989999999999E-4,1.8999229999999999E-4,2.975502E-2,1.0822236E-3,2.2402034000000001E-2]
[null,null,{"$f":"C50=C45","v":false},{"$f":"D50=D45","v":false},false,false,false,false,false,false,false,false]
[null,null,{"$f":"C50-C45","v":-2.8470961999999995E-3},{"$f":"D50-D45","v":-2.9507892999999993E-3},3.4364099999999991E-3,-1.7587040000000002E-2,-2.6488819377999996E-3,7.9780084539999999E-4,-9.8453309999999993E-4,2.9476349700000001E-2,-4.2560810399999996E-2,1.4887997100000001E-2]
[]
[]
[null,"System processes"]
[]
["Calculation: ","Compare"]
["Results: ","Impact assessment"]
["Product 1: ","1 kWh threshold value, methane/kWh/CH U (of project 208 naturemade KWM)"]
["Product 2: ","1 kWh threshold value, heat/kWh/CH U (of project 208 naturemade KWM)"]
["Product 3: ","1 kWh threshold value, electricity/kWh/CH U (of project 208 naturemade KWM)"]
["Product 4: ","1 kWh threshold value, cooling/kWh/CH U (of project 208 naturemade KWM)"]
["Product 5: ","1 kg reference value, manure/kg/CH U (of project 208 naturemade KWM)"]
["Product 6: ","1 kg reference value, digested matter, solid/kg/CH U (of project 208 naturemade KWM)"]
["Product 7: ","1 kg reference value, digested matter, liquid/kg/CH U (of project 208 naturemade KWM)"]
["Product 8: ","1 CHF reference value, co-substrate disposal/CHF/CH U (of project 208 naturemade KWM)"]
["Product 9: ","1 kg reference value, raw sewage sludge treatment/kg/CH U (of project 208 naturemade KWM)"]
["Product 10: ","1 kg reference value, fuel from digester sludge/kg/CH U (of project 208 naturemade KWM)"]
["Method: ","Eco-indicator 99 (H) V2.09 / Europe EI 99 H/A"]
["Indicator: ","Single score"]
["Unit: ","mPt"]
["Skip categories: ","With result = 0"]
["Exclude infrastructure processes: ","No"]
["Exclude long-term emissions: ","Yes"]
["Per impact category: ","No"]
["Sorted on item: ","Damage category"]
["Sort order: ","Ascending"]
[]
["Damage category","Unit","threshold value, methane/kWh/CH U","threshold value, heat/kWh/CH U","threshold value, electricity/kWh/CH U","threshold value, cooling/kWh/CH U","reference value, manure/kg/CH U","reference value, digested matter, solid/kg/CH U","reference value, digested matter, liquid/kg/CH U","reference value, co-substrate disposal/CHF/CH U","reference value, raw sewage sludge treatment/kg/CH U","reference value, fuel from digester sludge/kg/CH U"]
["Total","Pt",9.1910368999999995E-3,9.1051629999999995E-3,1.6310958E-2,2.9897765000000001E-3,4.8660290999999998E-6,1.1496123E-3,2.7275937000000001E-4,4.2717312E-2,1.5865250000000001E-3,2.6689257000000001E-2]
["Human Health","Pt",1.517755E-3,1.6061414999999999E-3,3.0072649999999999E-3,1.7473018E-3,2.8140084000000001E-6,7.8969138999999999E-4,1.8736379E-4,2.9343365E-2,1.1067161E-3,4.8997588999999996E-3]
["Ecosystem Quality","Pt",4.9443671999999999E-5,6.0404166E-5,1.2300207E-4,4.0843234999999998E-4,4.8902129000000004E-7,1.1646702E-4,2.7633203E-5,4.3276833000000002E-3,9.2141769999999997E-5,1.7081122E-4]
["Resources","Pt",7.6238382E-3,7.4386173999999999E-3,1.3180691E-2,8.3404238999999997E-4,1.5629992999999999E-6,2.4345392000000001E-4,5.7762374000000003E-5,9.0462644999999998E-3,3.8766712999999998E-4,2.1618687000000001E-2]