{"text_format":"2","workbook":"xlsx","n_sheets":7,"sheets":["Info","Prüfung","Umweltdeklaration","LRV","menues","LCIA","Prüfwert"],"not_rendered":{"charts":1,"images":2,"macros":0,"external_links":0,"defined_names":64,"comments":2,"pivot_tables":0},"unopened":[],"bounds":{"document_bytes":16777216,"sheet_cells":100000,"run_cost":"one","rows_first":2000,"rows_last":500,"rows_between":2000,"halvings":0,"cell_chars":16384,"cell_head_chars":4096},"cells_cut":0,"cells_raw":0,"read":"whole","date_system":"1900"}

{"sheet":"Info","index":0,"n_rows":56,"n_cols":2,"rows_kept":56,"cut":false,"hidden":false,"merged":[]}
[]
[{"$f":"Prüfung!B2","v":"naturemade Star Prüfung: Energieprodukte aus Holzenergieanlagen"}]
["Kenngrössenmodell erstellt durch Niels Jungbluth, ESU-services GmbH"]
[]
["Anleitung"]
["Alle weissen Felder im Blatt „Prüfung“ müssen ausgefüllt werden. Bei Eingabe einer Null erscheint die für die Eingabe geforderte Einheit. Bestehende Formeln in weissen Zellen können mit direkten Eingaben oder eigenen Formeln ersetzt werden. Farbige Zellen dürfen nicht verändert werden. Aus den Drop-Down Menüs müssen die passenden Anlagenspezifikationen ausgewählt werden."]
["Die automatische Berechnung in Excel muss eingeschaltet sein (/Extras/Optionen/Berechnung --> automatisch) oder man kann mit [F9] Taste jeweils neu berechnen lassen."]
["Alle Angaben müssen für einen einheitlich Zeitraum (in der Regel ein Jahr) eingegeben werden."]
["In der Spalte \"Prüfungen\" im Blatt Prüfungen werden spezielle Aspekte der Eingabe kontrolliert. Durch anklicken eines Kästchens wird im Kommentarfeld die Frage der Prüfung angegeben."]
["ORC - Organic Ranking Cycle"]
{"$rows_left_out":47}
{"sheet":"Prüfung","index":1,"n_rows":44,"n_cols":15,"rows_kept":44,"cut":false,"hidden":false,"merged":[]}
[null,null,41,42,null,44,72,73]
[2,{"$f":"INDEX(menues!$1:$1048576,$A2,sprache)","v":"naturemade Star Prüfung: Energieprodukte aus Holzenergieanlagen"},{"$nulls":6},"Prüfungen"]
[3,{"$f":"INDEX(menues!$1:$1048576,$A3,sprache)","v":"Eingabe:"},{"$nulls":6},"",1]
[4,{"$f":"INDEX(menues!$1:$1048576,$A4,sprache)","v":"Anlagenname und Referenzzeitraum"},"Beispielanlage",{"$nulls":5},""]
[6,{"$f":"INDEX(menues!$1:$1048576,$A5,sprache)","v":"Anlagentyp"},{"$nulls":6},{"$f":"NOT(AND(Anlagentyp=1,C32>0))","v":true},2]
[7,{"$f":"INDEX(menues!$1:$1048576,$A6,sprache)","v":"Inputs"},{"$f":"INDEX(menues!$1:$1048576,$C1,sprache)","v":"Schütt-kubikmeter"},{"$f":"INDEX(menues!$1:$1048576,D1,sprache)","v":"relative Feuchte (W)"},"atro",{"$f":"INDEX(menues!$1:$1048576,$F1,sprache)","v":"Mittlere einfache Transportentfernung, Lkw"},{"$f":"INDEX(menues!$1:$1048576,$G1,sprache)","v":"Mittlere einfache Transportentfernung, Bahn"},{"$f":"INDEX(menues!$1:$1048576,$H1,sprache)","v":"Mittlere einfache Transportentfernung, Schiff"},""]
[75,{"$f":"INDEX(menues!$1:$1048576,$A7,sprache)","v":"Holzschnitzel, Laubbaum"},0,0.45,{"$f":"TRANSPOSE(LCIA!C17:G17)","v":0},0,0,0,""]
[76,{"$f":"INDEX(menues!$1:$1048576,$A8,sprache)","v":"Holzschnitzel, Nadelbaum"},0,0.45,0,0,0,0,"",{"$nulls":4},{"$f":"name","v":"Beispielanlage"},{"$f":"Umweltdeklaration!B11","v":"Prüfwert"}]
[77,{"$f":"INDEX(menues!$1:$1048576,$A9,sprache)","v":"Holzschnitzel, Restholz (z.B. aus Sägerei)"},0,0.2857142857142857,0,0,0,0,"",null,null,null,{"$f":"Umweltdeklaration!B4","v":"eingekaufte Substrate"},{"$f":"Umweltdeklaration!H4","v":0}]
[74,{"$f":"INDEX(menues!$1:$1048576,$A10,sprache)","v":"Holzpellets"},0,9.0909090909090981E-2,0,0,0,0,"",null,null,null,{"$f":"Umweltdeklaration!B5","v":"Fremdenergiebedarf"},{"$f":"Umweltdeklaration!H5","v":0}]
{"$rows_left_out":35}
{"sheet":"Umweltdeklaration","index":2,"n_rows":22,"n_cols":11,"rows_kept":22,"cut":false,"hidden":false,"merged":[]}
[{"$nulls":7},29,35,34,31]
[29,{"$f":"name","v":"Beispielanlage"},null,{"$f":"H2","v":"EI'99-aggregated, Hierarchist"},"Anteil",null,null,{"$f":"INDEX(menues!$1:$1048576,H1,sprache)","v":"EI'99-aggregated, Hierarchist"},{"$f":"INDEX(menues!$1:$1048576,$I1,sprache)","v":"Treibhauseffekt 100a 2013"},{"$f":"INDEX(menues!$1:$1048576,J1,sprache)","v":"Bedarf nichterneuerbarer energetischer Ressourcen"},{"$f":"INDEX(menues!$1:$1048576,K1,sprache)","v":"Umweltbelastungspunkte 2013"}]
[56,null,null,{"$f":"H3","v":"Pkt"},null,null,null,"Pkt","kg CO2-eq","MJ-eq","Pkt"]
[46,{"$f":"INDEX(menues!$1:$1048576,$A4,sprache)","v":"eingekaufte Substrate"},null,null,{"$f":"H4/H$9","v":{"$error":"#DIV/0!"}},null,null,{"$f":"SUM(LCIA!$C$10:$H$10)","v":0},{"$f":"SUM(LCIA!$C$11:$H$11)","v":0},{"$f":"SUM(LCIA!$C$12:$H$12)","v":0},{"$f":"SUM(LCIA!$C$13:$H$13)","v":0}]
[45,{"$f":"INDEX(menues!$1:$1048576,$A5,sprache)","v":"Fremdenergiebedarf"},null,null,{"$error":"#DIV/0!"},null,null,{"$f":"SUM(LCIA!$I$10:$L$10)","v":0},{"$f":"SUM(LCIA!$I$11:$L$11)","v":0},{"$f":"SUM(LCIA!$I$12:$L$12)","v":0},{"$f":"SUM(LCIA!$I$13:$L$13)","v":0}]
[47,{"$f":"INDEX(menues!$1:$1048576,$A6,sprache)","v":"Transporte"},null,null,{"$error":"#DIV/0!"},null,null,{"$f":"SUM(LCIA!$M$10:$P$10)","v":0},{"$f":"SUM(LCIA!$M$11:$P$11)","v":0},{"$f":"SUM(LCIA!$M$12:$P$12)","v":0},{"$f":"SUM(LCIA!$M$13:$P$13)","v":0}]
[48,{"$f":"INDEX(menues!$1:$1048576,$A7,sprache)","v":"Verbrennung, Verteilung"},null,null,{"$error":"#DIV/0!"},null,null,{"$f":"SUM(LCIA!$Q$10:$AD$10)","v":0},{"$f":"SUM(LCIA!$Q$11:$AD$11)","v":0},{"$f":"SUM(LCIA!$Q$12:$AD$12)","v":0},{"$f":"SUM(LCIA!$Q$13:$AD$13)","v":0}]
[64,{"$f":"INDEX(menues!$1:$1048576,$A8,sprache)","v":"Aschen zur Entsorgung"},null,null,{"$error":"#DIV/0!"},null,null,{"$f":"SUM(LCIA!$AE$10:$AI$10)","v":0},{"$f":"SUM(LCIA!$AE$11:$AI$11)","v":0},{"$f":"SUM(LCIA!$AE$12:$AI$12)","v":0},{"$f":"SUM(LCIA!$AE$13:$AI$13)","v":0}]
[17,{"$f":"INDEX(menues!$1:$1048576,$A9,sprache)","v":"Total"},null,null,{"$error":"#DIV/0!"},null,null,{"$f":"SUM(H4:H8)","v":0},{"$f":"SUM(I4:I8)","v":0},{"$f":"SUM(J4:J8)","v":0},{"$f":"SUM(K4:K8)","v":0}]
[49]
{"$rows_left_out":13}
{"sheet":"LRV","index":3,"n_rows":22,"n_cols":14,"rows_kept":22,"cut":false,"hidden":false,"merged":[]}
[null,null,"bis 70 kW","70 kW bis 500 kW","500 kW bis 1 MW","1 MW bis 10 MW","über 10 MW"]
["Sauerstoffgehalt im Abgas","%vol","    13","    13","  13","  11","  11"]
["Stickoxide (NOx)","mg/m3",250,250,250,250,150]
["Feststoffe insgesamt (Staub)","mg/m3","      –",150,20,20,10]
["      ab 1. Januar 2012","mg/m3","      –",50,20,20,10]
["Kohlenmonoxid (CO)","mg/m3",1000,1000,500,250,150]
["      ab 1. Januar 2012","mg/m3",1000,500,500,250,150]
["gasförmige organische Stoffe, angegeben als Gesamtkohlenstoff (C)","mg/m3","      –","      –","    –","    –",50]
["Ammoniak und Ammoniumverbindungen, angegeben als Ammoniak","mg/m3","      –","      –","    –",30,30]
[]
{"$rows_left_out":13}
{"sheet":"menues","index":4,"n_rows":103,"n_cols":6,"rows_kept":103,"cut":false,"hidden":true,"merged":[]}
["Deutsch","Français","English","Italian",null,"Text"]
["naturemade Star Prüfung: Energieprodukte aus Holzenergieanlagen","Contrôle éco-électricité: produits d'énergie des installations de bois énergie",null,null,2,"Deutsch"]
["Eingabe:","Entrée:",null,null,3,"Français"]
["Anlagenname und Referenzzeitraum","Nom de l'installation et période de référence:",null,null,4]
["Menge","Quantité",null,null,5]
["Anlagentyp","Type d'installation",null,null,6]
["Inputs","Inputs",null,null,7]
["Substrate","Substrats pour l'installation",null,null,8]
["Strombezug aus Netz","Consommation d'électricité du réseau",null,null,9]
["Heizölverbrauch","Consommation de mazout",null,null,10]
{"$rows_left_out":94}
{"sheet":"LCIA","index":5,"n_rows":240,"n_cols":35,"rows_kept":240,"cut":false,"hidden":true,"merged":[]}
["Zeile",null,75,76,77,74,78,23,9,10,87,18,21,21,21,30,24,16,21,21,21,21,21,null,81,82,83,84,85,32,64,64,64,64,64]
[null,null,{"$f":"INDEX(menues!$1:$1048576,C1,sprache)","v":"Holzschnitzel, Laubbaum"},{"$f":"INDEX(menues!$1:$1048576,D1,sprache)","v":"Holzschnitzel, Nadelbaum"},{"$f":"INDEX(menues!$1:$1048576,E1,sprache)","v":"Holzschnitzel, Restholz (z.B. aus Sägerei)"},{"$f":"INDEX(menues!$1:$1048576,F1,sprache)","v":"Holzpellets"},{"$f":"INDEX(menues!$1:$1048576,G1,sprache)","v":"Holzschnitzel, Altholz"},{"$f":"INDEX(menues!$1:$1048576,H1,sprache)","v":"Rapsölmethylester"},{"$f":"INDEX(menues!$1:$1048576,I1,sprache)","v":"Strombezug aus Netz"},{"$f":"INDEX(menues!$1:$1048576,J1,sprache)","v":"Heizölverbrauch"},{"$f":"INDEX(menues!$1:$1048576,K1,sprache)","v":"Dieselverbrauch (10 kWh/Liter)"},{"$f":"INDEX(menues!$1:$1048576,L1,sprache)","v":"Erdgasverbrauch"},{"$f":"INDEX(menues!$1:$1048576,M1,sprache)","v":"Gesamtinputmenge für Anlage"},{"$f":"INDEX(menues!$1:$1048576,N1,sprache)","v":"Gesamtinputmenge für Anlage"},{"$f":"INDEX(menues!$1:$1048576,O1,sprache)","v":"Gesamtinputmenge für Anlage"},{"$f":"INDEX(menues!$1:$1048576,P1,sprache)","v":"Einfache Distanz Anlage - Ausbringung/Entsorgung"},{"$f":"INDEX(menues!$1:$1048576,Q1,sprache)","v":"ungewollte Biogas Verluste (Methanschlupf und Unterbrüche)"},{"$f":"INDEX(menues!$1:$1048576,R1,sprache)","v":"Biomethan: Verkauf und Verbrauch ausserhalb der Anlage"},{"$f":"INDEX(menues!$1:$1048576,S1,sprache)","v":"Gesamtinputmenge für Anlage"},{"$f":"INDEX(menues!$1:$1048576,T1,sprache)","v":"Gesamtinputmenge für Anlage"},{"$f":"INDEX(menues!$1:$1048576,U1,sprache)","v":"Gesamtinputmenge für Anlage"},{"$f":"INDEX(menues!$1:$1048576,V1,sprache)","v":"Gesamtinputmenge für Anlage"},{"$f":"INDEX(menues!$1:$1048576,W1,sprache)","v":"Gesamtinputmenge für Anlage"},"Nm3/a",{"$f":"INDEX(menues!$1:$1048576,Y1,sprache)","v":"Stickoxide NOx als NO2 / Emissionsgrenzwerte gemäss LRV"},{"$f":"INDEX(menues!$1:$1048576,Z1,sprache)","v":"Staub (= Feststoffe), PM10 / Emissionsgrenzwerte gemäss LRV"},{"$f":"INDEX(menues!$1:$1048576,AA1,sprache)","v":"Blei / Emissionsgrenzwerte gemäss LRV"},{"$f":"INDEX(menues!$1:$1048576,AB1,sprache)","v":"Cadmium / Emissionsgrenzwerte gemäss LRV"},{"$f":"INDEX(menues!$1:$1048576,AC1,sprache)","v":"Zink / Emissionsgrenzwerte gemäss LRV"},{"$f":"INDEX(menues!$1:$1048576,AD1,sprache)","v":"Einspeisung Wärmeverbund / Verteilverluste"},{"$f":"INDEX(menues!$1:$1048576,AE1,sprache)","v":"Aschen zur Entsorgung"},{"$f":"INDEX(menues!$1:$1048576,AF1,sprache)","v":"Aschen zur Entsorgung"},{"$f":"INDEX(menues!$1:$1048576,AG1,sprache)","v":"Aschen zur Entsorgung"},{"$f":"INDEX(menues!$1:$1048576,AH1,sprache)","v":"Aschen zur Entsorgung"},{"$f":"INDEX(menues!$1:$1048576,AI1,sprache)","v":"Aschen zur Entsorgung"}]
["Eingabe 1",null,{"$f":"INDEX(Prüfung!$1:$1048576,MATCH(C$1,Prüfung!$A:$A,0),3)","v":0},{"$f":"INDEX(Prüfung!$1:$1048576,MATCH(D$1,Prüfung!$A:$A,0),3)","v":0},{"$f":"INDEX(Prüfung!$1:$1048576,MATCH(E$1,Prüfung!$A:$A,0),3)","v":0},{"$f":"INDEX(Prüfung!$1:$1048576,MATCH(F$1,Prüfung!$A:$A,0),3)","v":0},{"$f":"INDEX(Prüfung!$1:$1048576,MATCH(G$1,Prüfung!$A:$A,0),3)","v":0},{"$f":"INDEX(Prüfung!$1:$1048576,MATCH(H$1,Prüfung!$A:$A,0),3)","v":0},{"$f":"INDEX(Prüfung!$1:$1048576,MATCH(I$1,Prüfung!$A:$A,0),3)","v":0},{"$f":"INDEX(Prüfung!$1:$1048576,MATCH(J$1,Prüfung!$A:$A,0),3)","v":0},{"$f":"INDEX(Prüfung!$1:$1048576,MATCH(K$1,Prüfung!$A:$A,0),3)","v":0},{"$f":"INDEX(Prüfung!$1:$1048576,MATCH(L$1,Prüfung!$A:$A,0),3)","v":0},{"$f":"INDEX(Prüfung!$1:$1048576,MATCH(M$1,Prüfung!$A:$A,0),3)","v":0},{"$f":"INDEX(Prüfung!$1:$1048576,MATCH(N$1,Prüfung!$A:$A,0),3)","v":0},{"$f":"INDEX(Prüfung!$1:$1048576,MATCH(O$1,Prüfung!$A:$A,0),3)","v":0},{"$f":"INDEX(Prüfung!$1:$1048576,MATCH(P$1,Prüfung!$A:$A,0),3)","v":0},{"$f":"INDEX(Prüfung!$1:$1048576,MATCH(Q$1,Prüfung!$A:$A,0),3)","v":0},{"$f":"INDEX(Prüfung!$1:$1048576,MATCH(R$1,Prüfung!$A:$A,0),3)","v":0},{"$f":"INDEX(Prüfung!$1:$1048576,MATCH(S$1,Prüfung!$A:$A,0),3)","v":0},{"$f":"INDEX(Prüfung!$1:$1048576,MATCH(T$1,Prüfung!$A:$A,0),3)","v":0},{"$f":"INDEX(Prüfung!$1:$1048576,MATCH(U$1,Prüfung!$A:$A,0),3)","v":0},{"$f":"INDEX(Prüfung!$1:$1048576,MATCH(V$1,Prüfung!$A:$A,0),3)","v":0},{"$f":"INDEX(Prüfung!$1:$1048576,MATCH(W$1,Prüfung!$A:$A,0),3)","v":0},null,{"$f":"INDEX(Prüfung!$1:$1048576,MATCH(Y$1,Prüfung!$A:$A,0),3)","v":250},{"$f":"INDEX(Prüfung!$1:$1048576,MATCH(Z$1,Prüfung!$A:$A,0),3)","v":20},{"$f":"INDEX(Prüfung!$1:$1048576,MATCH(AA$1,Prüfung!$A:$A,0),3)","v":0},{"$f":"INDEX(Prüfung!$1:$1048576,MATCH(AB$1,Prüfung!$A:$A,0),3)","v":0},{"$f":"INDEX(Prüfung!$1:$1048576,MATCH(AC$1,Prüfung!$A:$A,0),3)","v":0},{"$f":"INDEX(Prüfung!$1:$1048576,MATCH(AD$1,Prüfung!$A:$A,0),3)","v":0},{"$f":"INDEX(Prüfung!$1:$1048576,MATCH(AE$1,Prüfung!$A:$A,0),3)","v":0},{"$f":"INDEX(Prüfung!$1:$1048576,MATCH(AF$1,Prüfung!$A:$A,0),3)","v":0},{"$f":"INDEX(Prüfung!$1:$1048576,MATCH(AG$1,Prüfung!$A:$A,0),3)","v":0},{"$f":"INDEX(Prüfung!$1:$1048576,MATCH(AH$1,Prüfung!$A:$A,0),3)","v":0},{"$f":"INDEX(Prüfung!$1:$1048576,MATCH(AI$1,Prüfung!$A:$A,0),3)","v":0}]
["Eingabe 2","W Wassergehalt",{"$f":"INDEX(Prüfung!$1:$1048576,MATCH(C$1,Prüfung!$A:$A,0),4)","v":0.45},{"$f":"INDEX(Prüfung!$1:$1048576,MATCH(D$1,Prüfung!$A:$A,0),4)","v":0.45},{"$f":"INDEX(Prüfung!$1:$1048576,MATCH(E$1,Prüfung!$A:$A,0),4)","v":0.2857142857142857},{"$f":"INDEX(Prüfung!$1:$1048576,MATCH(F$1,Prüfung!$A:$A,0),4)","v":9.0909090909090981E-2},{"$f":"INDEX(Prüfung!$1:$1048576,MATCH(G$1,Prüfung!$A:$A,0),4)","v":0.2857142857142857},{"$f":"INDEX(Prüfung!$1:$1048576,MATCH(H$1,Prüfung!$A:$A,0),4)","v":0},{"$f":"INDEX(Prüfung!$1:$1048576,MATCH(I$1,Prüfung!$A:$A,0),4)","v":0},{"$f":"INDEX(Prüfung!$1:$1048576,MATCH(J$1,Prüfung!$A:$A,0),4)","v":0},{"$f":"INDEX(Prüfung!$1:$1048576,MATCH(K$1,Prüfung!$A:$A,0),4)","v":0},{"$f":"INDEX(Prüfung!$1:$1048576,MATCH(L$1,Prüfung!$A:$A,0),4)","v":0},{"$f":"INDEX(Prüfung!$1:$1048576,MATCH(M$1,Prüfung!$A:$A,0),4)","v":{"$error":"#DIV/0!"}},{"$f":"INDEX(Prüfung!$1:$1048576,MATCH(N$1,Prüfung!$A:$A,0),4)","v":{"$error":"#DIV/0!"}},{"$f":"INDEX(Prüfung!$1:$1048576,MATCH(O$1,Prüfung!$A:$A,0),4)","v":{"$error":"#DIV/0!"}},{"$f":"INDEX(Prüfung!$1:$1048576,MATCH(P$1,Prüfung!$A:$A,0),4)","v":0},{"$f":"INDEX(Prüfung!$1:$1048576,MATCH(Q$1,Prüfung!$A:$A,0),4)","v":0},{"$f":"INDEX(Prüfung!$1:$1048576,MATCH(R$1,Prüfung!$A:$A,0),4)","v":0},{"$f":"INDEX(Prüfung!$1:$1048576,MATCH(S$1,Prüfung!$A:$A,0),4)","v":{"$error":"#DIV/0!"}},{"$f":"INDEX(Prüfung!$1:$1048576,MATCH(T$1,Prüfung!$A:$A,0),4)","v":{"$error":"#DIV/0!"}},{"$f":"INDEX(Prüfung!$1:$1048576,MATCH(U$1,Prüfung!$A:$A,0),4)","v":{"$error":"#DIV/0!"}},{"$f":"INDEX(Prüfung!$1:$1048576,MATCH(V$1,Prüfung!$A:$A,0),4)","v":{"$error":"#DIV/0!"}},{"$f":"INDEX(Prüfung!$1:$1048576,MATCH(W$1,Prüfung!$A:$A,0),4)","v":{"$error":"#DIV/0!"}},null,{"$f":"Y5*kWhHolz_tAtro*3.6*1000000/1000/Nm3_kgAtro","v":226.24},{"$f":"Z5*kWhHolz_tAtro*3.6*1000000/1000/Nm3_kgAtro","v":224.21999999999994},{"$f":"AA5*kWhHolz_tAtro*3.6*1000000/1000/Nm3_kgAtro","v":5.0499999999999989E-2},{"$f":"AB5*kWhHolz_tAtro*3.6*1000000/1000/Nm3_kgAtro","v":1.4139999999999995E-3},{"$f":"AC5*kWhHolz_tAtro*3.6*1000000/1000/Nm3_kgAtro","v":0.60599999999999998},{"$f":"INDEX(Prüfung!$1:$1048576,MATCH(AD$1,Prüfung!$A:$A,0),4)","v":0.20300000000000001},{"$f":"INDEX(Prüfung!$1:$1048576,MATCH(AE$1,Prüfung!$A:$A,0),4)","v":0},{"$f":"INDEX(Prüfung!$1:$1048576,MATCH(AF$1,Prüfung!$A:$A,0),4)","v":0},{"$f":"INDEX(Prüfung!$1:$1048576,MATCH(AG$1,Prüfung!$A:$A,0),4)","v":0},{"$f":"INDEX(Prüfung!$1:$1048576,MATCH(AH$1,Prüfung!$A:$A,0),4)","v":0},{"$f":"INDEX(Prüfung!$1:$1048576,MATCH(AI$1,Prüfung!$A:$A,0),4)","v":0}]
["Eingabe 3","U Feuchte",{"$f":"IF(C3>0,(C18/C17-1),0)","v":0},{"$f":"IF(D3>0,(D18/D17-1),0)","v":0},{"$f":"IF(E3>0,(E18/E17-1),0)","v":0},{"$f":"IF(F3>0,(F18/F17-1),0)","v":0},{"$f":"IF(G3>0,(G18/G17-1),0)","v":0},{"$f":"INDEX(Prüfung!$1:$1048576,MATCH(H$1,Prüfung!$A:$A,0),5)","v":0},{"$f":"INDEX(Prüfung!$1:$1048576,MATCH(I$1,Prüfung!$A:$A,0),5)","v":0},{"$f":"INDEX(Prüfung!$1:$1048576,MATCH(J$1,Prüfung!$A:$A,0),5)","v":0},{"$f":"INDEX(Prüfung!$1:$1048576,MATCH(K$1,Prüfung!$A:$A,0),5)","v":0},{"$f":"INDEX(Prüfung!$1:$1048576,MATCH(L$1,Prüfung!$A:$A,0),5)","v":0},{"$f":"INDEX(Prüfung!$1:$1048576,MATCH(M$1,Prüfung!$A:$A,0),5)","v":{"$error":"#DIV/0!"}},{"$f":"INDEX(Prüfung!$1:$1048576,MATCH(N$1,Prüfung!$A:$A,0),5)","v":{"$error":"#DIV/0!"}},{"$f":"INDEX(Prüfung!$1:$1048576,MATCH(O$1,Prüfung!$A:$A,0),5)","v":{"$error":"#DIV/0!"}},{"$f":"INDEX(Prüfung!$1:$1048576,MATCH(P$1,Prüfung!$A:$A,0),5)","v":0},{"$f":"INDEX(Prüfung!$1:$1048576,MATCH(Q$1,Prüfung!$A:$A,0),5)","v":0},{"$f":"INDEX(Prüfung!$1:$1048576,MATCH(R$1,Prüfung!$A:$A,0),5)","v":0},{"$f":"INDEX(Prüfung!$1:$1048576,MATCH(S$1,Prüfung!$A:$A,0),5)","v":{"$error":"#DIV/0!"}},{"$f":"INDEX(Prüfung!$1:$1048576,MATCH(T$1,Prüfung!$A:$A,0),5)","v":{"$error":"#DIV/0!"}},{"$f":"INDEX(Prüfung!$1:$1048576,MATCH(U$1,Prüfung!$A:$A,0),5)","v":{"$error":"#DIV/0!"}},{"$f":"INDEX(Prüfung!$1:$1048576,MATCH(V$1,Prüfung!$A:$A,0),5)","v":{"$error":"#DIV/0!"}},{"$f":"INDEX(Prüfung!$1:$1048576,MATCH(W$1,Prüfung!$A:$A,0),5)","v":{"$error":"#DIV/0!"}},{"$f":"Nm3_kgAtro/kWhHolz_tAtro*1000/3.6*$V3*3.6-R5*1000*Y16","v":0},1.12E-4,1.11E-4,2.4999999999999999E-8,6.9999999999999975E-10,3.0000000000000004E-7,{"$f":"INDEX(Prüfung!$1:$1048576,MATCH(AD$1,Prüfung!$A:$A,0),5)","v":{"$error":"#DIV/0!"}},{"$f":"INDEX(Prüfung!$1:$1048576,MATCH(AE$1,Prüfung!$A:$A,0),5)","v":0},{"$f":"INDEX(Prüfung!$1:$1048576,MATCH(AF$1,Prüfung!$A:$A,0),5)","v":0},{"$f":"INDEX(Prüfung!$1:$1048576,MATCH(AG$1,Prüfung!$A:$A,0),5)","v":0},{"$f":"INDEX(Prüfung!$1:$1048576,MATCH(AH$1,Prüfung!$A:$A,0),5)","v":0},{"$f":"INDEX(Prüfung!$1:$1048576,MATCH(AI$1,Prüfung!$A:$A,0),5)","v":0}]
["Eingabe 4",6,{"$f":"INDEX(Prüfung!$1:$1048576,MATCH(C$1,Prüfung!$A:$A,0),$B6)","v":0},{"$f":"INDEX(Prüfung!$1:$1048576,MATCH(D$1,Prüfung!$A:$A,0),$B6)","v":0},{"$f":"INDEX(Prüfung!$1:$1048576,MATCH(E$1,Prüfung!$A:$A,0),$B6)","v":0},{"$f":"INDEX(Prüfung!$1:$1048576,MATCH(F$1,Prüfung!$A:$A,0),$B6)","v":0},{"$f":"INDEX(Prüfung!$1:$1048576,MATCH(G$1,Prüfung!$A:$A,0),$B6)","v":0},{"$f":"INDEX(Prüfung!$1:$1048576,MATCH(H$1,Prüfung!$A:$A,0),$B6)","v":0},{"$f":"INDEX(Prüfung!$1:$1048576,MATCH(I$1,Prüfung!$A:$A,0),6)","v":0},{"$f":"INDEX(Prüfung!$1:$1048576,MATCH(J$1,Prüfung!$A:$A,0),6)","v":0},{"$f":"INDEX(Prüfung!$1:$1048576,MATCH(K$1,Prüfung!$A:$A,0),6)","v":0},{"$f":"INDEX(Prüfung!$1:$1048576,MATCH(L$1,Prüfung!$A:$A,0),6)","v":0},{"$f":"SUMPRODUCT($C18:$H18,$C6:$H6)","v":0},{"$f":"SUMPRODUCT($C18:$H18,$C7:$H7)","v":0},{"$f":"SUMPRODUCT($C18:$H18,$C8:$H8)","v":0},{"$f":"INDEX(Prüfung!$1:$1048576,MATCH(P$1,Prüfung!$A:$A,0),6)","v":0},{"$f":"INDEX(Prüfung!$1:$1048576,MATCH(Q$1,Prüfung!$A:$A,0),6)","v":0},{"$f":"INDEX(Prüfung!$1:$1048576,MATCH(R$1,Prüfung!$A:$A,0),6)","v":0},{"$f":"INDEX(Prüfung!$1:$1048576,MATCH(S$1,Prüfung!$A:$A,0),6)","v":0},{"$f":"INDEX(Prüfung!$1:$1048576,MATCH(T$1,Prüfung!$A:$A,0),6)","v":0},{"$f":"INDEX(Prüfung!$1:$1048576,MATCH(U$1,Prüfung!$A:$A,0),6)","v":0},{"$f":"INDEX(Prüfung!$1:$1048576,MATCH(V$1,Prüfung!$A:$A,0),6)","v":0},{"$f":"INDEX(Prüfung!$1:$1048576,MATCH(W$1,Prüfung!$A:$A,0),6)","v":0},null,{"$f":"(Y3-Y4)*0.000001*Nm3_Abgas","v":0},{"$f":"(Z3-Z4)*0.000001*Nm3_Abgas","v":0},{"$f":"(AA3-AA4)*0.000001*Nm3_Abgas","v":0},{"$f":"(AB3-AB4)*0.000001*Nm3_Abgas","v":0},{"$f":"(AC3-AC4)*0.000001*Nm3_Abgas","v":0},{"$f":"INDEX(Prüfung!$1:$1048576,MATCH(AD$1,Prüfung!$A:$A,0),6)","v":0},{"$f":"INDEX(Prüfung!$1:$1048576,MATCH(AE$1,Prüfung!$A:$A,0),6)","v":100},{"$f":"INDEX(Prüfung!$1:$1048576,MATCH(AF$1,Prüfung!$A:$A,0),6)","v":100},{"$f":"INDEX(Prüfung!$1:$1048576,MATCH(AG$1,Prüfung!$A:$A,0),6)","v":100},{"$f":"INDEX(Prüfung!$1:$1048576,MATCH(AH$1,Prüfung!$A:$A,0),6)","v":100},{"$f":"INDEX(Prüfung!$1:$1048576,MATCH(AI$1,Prüfung!$A:$A,0),6)","v":100}]
["Eingabe 5",7,{"$f":"INDEX(Prüfung!$1:$1048576,MATCH(C$1,Prüfung!$A:$A,0),$B7)","v":0},{"$f":"INDEX(Prüfung!$1:$1048576,MATCH(D$1,Prüfung!$A:$A,0),$B7)","v":0},{"$f":"INDEX(Prüfung!$1:$1048576,MATCH(E$1,Prüfung!$A:$A,0),$B7)","v":0},{"$f":"INDEX(Prüfung!$1:$1048576,MATCH(F$1,Prüfung!$A:$A,0),$B7)","v":0},{"$f":"INDEX(Prüfung!$1:$1048576,MATCH(G$1,Prüfung!$A:$A,0),$B7)","v":0},{"$f":"INDEX(Prüfung!$1:$1048576,MATCH(H$1,Prüfung!$A:$A,0),$B7)","v":0}]
["Eingabe 6",8,{"$f":"INDEX(Prüfung!$1:$1048576,MATCH(C$1,Prüfung!$A:$A,0),$B8)","v":0},{"$f":"INDEX(Prüfung!$1:$1048576,MATCH(D$1,Prüfung!$A:$A,0),$B8)","v":0},{"$f":"INDEX(Prüfung!$1:$1048576,MATCH(E$1,Prüfung!$A:$A,0),$B8)","v":0},{"$f":"INDEX(Prüfung!$1:$1048576,MATCH(F$1,Prüfung!$A:$A,0),$B8)","v":0},{"$f":"INDEX(Prüfung!$1:$1048576,MATCH(G$1,Prüfung!$A:$A,0),$B8)","v":0},{"$f":"INDEX(Prüfung!$1:$1048576,MATCH(H$1,Prüfung!$A:$A,0),$B8)","v":0}]
["Umrechnungsfaktor",null,{"$f":"C3*(1-C4)/(1-C15)","v":0},{"$f":"D3*(1-D4)/(1-D15)","v":0},{"$f":"E3*(1-E4)/(1-E15)","v":0},{"$f":"F3*(1-F4)/(1-F15)","v":0},{"$f":"G3*(1-G4)/(1-G15)","v":0},{"$f":"H3","v":0},{"$f":"I3","v":0},{"$f":"J3","v":0},{"$f":"K3","v":0},{"$f":"L3","v":0},{"$f":"M6","v":0},{"$f":"N6","v":0},{"$f":"O6","v":0},{"$f":"P6","v":0},{"$f":"Q3","v":0},{"$f":"IF(Anlagentyp=R14,R5*1,0)","v":0},{"$f":"IF(Anlagentyp=S14,S3*1,0)","v":0},{"$f":"IF(Anlagentyp=T14,T3*1,0)","v":0},{"$f":"IF(Anlagentyp=U14,U3*1,0)","v":0},{"$f":"IF(Anlagentyp=V14,V3*1,0)","v":0},{"$f":"IF(Anlagentyp=W14,W3*1,0)","v":0},{"$f":"IF(SUM(V9:W9)>0,Nm3_Abgas,0)","v":0},{"$f":"Y6","v":0},{"$f":"Z6","v":0},{"$f":"IF(altholzverbrennung,AA6,0)","v":0},{"$f":"IF(altholzverbrennung,AB6,0)","v":0},{"$f":"IF(altholzverbrennung,AC6,0)","v":0},{"$f":"AD3","v":0},{"$f":"IF(Auswahl_Behandlung_fest=LCIA!AE14,LCIA!AE4,0)","v":0},{"$f":"IF(Auswahl_Behandlung_fest=LCIA!AF14,LCIA!AF4,0)","v":0},{"$f":"IF(Auswahl_Behandlung_fest=LCIA!AG14,LCIA!AG4,0)","v":0},{"$f":"IF(Auswahl_Behandlung_fest=LCIA!AH14,LCIA!AH4,0)","v":0},{"$f":"IF(Auswahl_Behandlung_fest=LCIA!AI14,LCIA!AI4,0)","v":0}]
["Eco-indicator",{"$f":"SUM(C10:AI10)","v":0},{"$f":"C67*C9","v":0},0,0,0,0,0,0,{"$f":"J67*J$9","v":0},{"$f":"K67*K9","v":0},0,0,{"$f":"N67*N9","v":0},{"$f":"O67*O9","v":0},0,0,0,0,0,0,0,0,{"$f":"X67*X9","v":0},{"$f":"Y67*Y9","v":0},0,0,0,0,0,0,0,0,0,0]
{"$rows_left_out":231}
{"sheet":"Prüfwert","index":6,"n_rows":83,"n_cols":17,"rows_kept":83,"cut":false,"hidden":true,"merged":[]}
["Referenz",null,53,52,51,91,88,null,null,54,90,101,null,89,63]
[null,null,{"$f":"INDEX(menues!$1:$1048576,C1,sprache)","v":"Grenzwert Methan"},{"$f":"INDEX(menues!$1:$1048576,D1,sprache)","v":"Grenzwert Wärme"},{"$f":"INDEX(menues!$1:$1048576,E1,sprache)","v":"Grenzwert Strom"},{"$f":"INDEX(menues!$1:$1048576,F1,sprache)","v":"Grenzwert Kälte"},{"$f":"INDEX(menues!$1:$1048576,G1,sprache)","v":"Referenz Güllelager"},null,null,{"$f":"INDEX(menues!$1:$1048576,J1,sprache)","v":"Referenz Entsorgung"},{"$f":"INDEX(menues!$1:$1048576,K1,sprache)","v":"Referenz Frischklärschlamm"},{"$f":"INDEX(menues!$1:$1048576,L1,sprache)","v":0},null,{"$f":"INDEX(menues!$1:$1048576,N1,sprache)","v":"Referenz Kompost"},{"$f":"INDEX(menues!$1:$1048576,O1,sprache)","v":"Referenz direkte Emissionen"}]
["Zeile",null,16,62,14]
["Eingabe 1",null,{"$f":"INDEX(Prüfung!$1:$1048576,MATCH(C$3,Prüfung!$A:$A,0),3)","v":0},{"$f":"INDEX(Prüfung!$1:$1048576,MATCH(D$3,Prüfung!$A:$A,0),3)","v":0},{"$f":"INDEX(Prüfung!$1:$1048576,MATCH(E$3,Prüfung!$A:$A,0),3)","v":0}]
["Eingabe 2",null,null,{"$f":"INDEX(Prüfung!$1:$1048576,MATCH(D$3,Prüfung!$A:$A,0),4)","v":0},{"$f":"INDEX(Prüfung!$1:$1048576,MATCH(E$3,Prüfung!$A:$A,0),4)","v":0}]
["Eingabe 3",null,null,{"$f":"INDEX(Prüfung!$1:$1048576,MATCH(D$3,Prüfung!$A:$A,0),5)","v":{"$error":"#DIV/0!"}},{"$f":"INDEX(Prüfung!$1:$1048576,MATCH(E$3,Prüfung!$A:$A,0),5)","v":{"$error":"#DIV/0!"}}]
["Eingabe 4",null,null,{"$f":"INDEX(Prüfung!$1:$1048576,MATCH(D$3,Prüfung!$A:$A,0),6)","v":0},{"$f":"INDEX(Prüfung!$1:$1048576,MATCH(E$3,Prüfung!$A:$A,0),6)","v":0}]
["Umrechnungsfaktor",null,{"$f":"C4","v":0},{"$f":"D4","v":0},{"$f":"E4","v":0}]
["Direkte Emissionen"]
["Eco-indicator",{"$f":"SUM(C10:K10)","v":0},{"$f":"C8*C45+C9","v":0},{"$f":"D8*D45","v":0},{"$f":"E8*E45+E9","v":0},{"$f":"F8*F45+F9","v":0}]
{"$rows_left_out":73}